CI failed 15s
- Branch
chore/review-nits- Commit
dabf2344Paul Campbell
- Runner
claude~paul@keymail.dev/DOCS-T1- Reported by
claude~paul@keymail.dev/DOCS-T1- Queued
- Started
- Waited for a runner
- 2s
- Last change
- Attempt
- 1 of 2
Steps run in order, one after another.
-
vet passed 5s
go vet ./... go vet -tags browser ./internal/calendartest/
-
fmt passed
No output.
-
test failed 10s
go test ./... ? amadan.net/oficina/calendar/cmd/calendar [no test files] ok amadan.net/oficina/calendar/internal/calendar 5.869s ? amadan.net/oficina/calendar/internal/calendar/icons [no test files] ? amadan.net/oficina/calendar/internal/calendar/seal [no test files] --- FAIL: TestTransientControlFailureAtBootRecovers (2.01s) schedule_recovery_test.go:25: timer was not armed 2026/10/01 13:33:23 INFO migrate applied="[sessions/0001_init auth/0001_init auth/0002_sessions_backfill calendar/0001_create_people calendar/0002_alter_people calendar/0003_alter_reminders calendar/0004_create_attendees calendar/0005_alter_people calendar/0006_alter_reminder_queues]" skipped=0 adopted=false 2026/10/01 13:33:23 ERROR calendar: scheduled work registration failed stage=schedule.register err="calendar: this platform does not support safe scheduled work; update the platform before starting Calendar" FAIL FAIL amadan.net/oficina/calendar/internal/calendartest 6.341s ok amadan.net/oficina/calendar/internal/guardstest 0.127s ? amadan.net/oficina/calendar/scripts/writeestilo [no test files] FAIL make: *** [Makefile:85: test] Error 1 amadan: step test failed: exit status 2 -
migration-check not run
No output.
Whole run log
=== vet ===
go vet ./...
go vet -tags browser ./internal/calendartest/
=== fmt ===
=== test ===
go test ./...
? amadan.net/oficina/calendar/cmd/calendar [no test files]
ok amadan.net/oficina/calendar/internal/calendar 5.869s
? amadan.net/oficina/calendar/internal/calendar/icons [no test files]
? amadan.net/oficina/calendar/internal/calendar/seal [no test files]
--- FAIL: TestTransientControlFailureAtBootRecovers (2.01s)
schedule_recovery_test.go:25: timer was not armed
2026/10/01 13:33:23 INFO migrate applied="[sessions/0001_init auth/0001_init auth/0002_sessions_backfill calendar/0001_create_people calendar/0002_alter_people calendar/0003_alter_reminders calendar/0004_create_attendees calendar/0005_alter_people calendar/0006_alter_reminder_queues]" skipped=0 adopted=false
2026/10/01 13:33:23 ERROR calendar: scheduled work registration failed stage=schedule.register err="calendar: this platform does not support safe scheduled work; update the platform before starting Calendar"
FAIL
FAIL amadan.net/oficina/calendar/internal/calendartest 6.341s
ok amadan.net/oficina/calendar/internal/guardstest 0.127s
? amadan.net/oficina/calendar/scripts/writeestilo [no test files]
FAIL
make: *** [Makefile:85: test] Error 1
amadan: step test failed: exit status 2
amadan: job failed at step test — its output is above, not at the tail of this log
Watching for changes…