CI failed 5s
- Branch
native/docs-sheets-editors- Commit
a49307c2Paul Campbell
- Runner
claude~paul@keymail.dev/DOCS-T1- Reported by
claude~paul@keymail.dev/DOCS-T1- Queued
- Started
- Waited for a runner
- 3m 7s
- Last change
- Attempt
- 1 of 2
Steps run in order, one after another.
-
test failed 5s
swift test Building for debugging... [0/17] Write sources [4/17] Write swift-version--28C01585A1F674EC.txt [6/26] Emitting module RastrilloNative [7/26] Compiling RastrilloNative CoalescedRunner.swift [8/27] Compiling RastrilloApple NativeHTTP.swift /home/paulca/.local/state/amadan/runner/repos/rastrillo__native/wt/native__docs-sheets-editors/Sources/RastrilloApple/NativeConnection.swift:1:8: error: no such module 'Combine' 1 | import Combine | `- error: no such module 'Combine' 2 | import CryptoKit 3 | import Foundation [10/27] Compiling RastrilloApple NativeSignInView.swift /home/paulca/.local/state/amadan/runner/repos/rastrillo__native/wt/native__docs-sheets-editors/Sources/RastrilloApple/NativeConnection.swift:1:8: error: no such module 'Combine' 1 | import Combine | `- error: no such module 'Combine' 2 | import CryptoKit 3 | import Foundation [11/27] Compiling RastrilloApple NativeStreamLines.swift /home/paulca/.local/state/amadan/runner/repos/rastrillo__native/wt/native__docs-sheets-editors/Sources/RastrilloApple/NativeConnection.swift:1:8: error: no such module 'Combine' 1 | import Combine | `- error: no such module 'Combine' 2 | import CryptoKit 3 | import Foundation [12/27] Compiling RastrilloApple NativeResponse.swift /home/paulca/.local/state/amadan/runner/repos/rastrillo__native/wt/native__docs-sheets-editors/Sources/RastrilloApple/NativeConnection.swift:1:8: error: no such module 'Combine' 1 | import Combine | `- error: no such module 'Combine' 2 | import CryptoKit 3 | import Foundation [12/27] Wrapping AST for RastrilloNative for debugging [14/29] Emitting module RastrilloNativeTests [15/29] Compiling RastrilloNativeTests CoalescedRunnerTests.swift error: emit-module command failed with exit code 1 (use -v to see invocation) [17/30] Emitting module RastrilloApple /home/paulca/.local/state/amadan/runner/repos/rastrillo__native/wt/native__docs-sheets-editors/Sources/RastrilloApple/NativeConnection.swift:1:8: error: no such module 'Combine' 1 | import Combine | `- error: no such module 'Combine' 2 | import CryptoKit 3 | import Foundation [18/30] Compiling RastrilloApple NativeCredentials.swift /home/paulca/.local/state/amadan/runner/repos/rastrillo__native/wt/native__docs-sheets-editors/Sources/RastrilloApple/NativeConnection.swift:1:8: error: no such module 'Combine' 1 | import Combine | `- error: no such module 'Combine' 2 | import CryptoKit 3 | import Foundation [19/30] Compiling RastrilloApple NativeConnection.swift /home/paulca/.local/state/amadan/runner/repos/rastrillo__native/wt/native__docs-sheets-editors/Sources/RastrilloApple/NativeConnection.swift:1:8: error: no such module 'Combine' 1 | import Combine | `- error: no such module 'Combine' 2 | import CryptoKit 3 | import Foundation [19/30] Wrapping AST for RastrilloNativeTests for debugging error: fatalError make: *** [Makefile:4: test] Error 1 amadan: step test failed: exit status 2
-
companion not run
No output.
Whole run log
=== test === swift test Building for debugging... [0/17] Write sources [4/17] Write swift-version--28C01585A1F674EC.txt [6/26] Emitting module RastrilloNative [7/26] Compiling RastrilloNative CoalescedRunner.swift [8/27] Compiling RastrilloApple NativeHTTP.swift /home/paulca/.local/state/amadan/runner/repos/rastrillo__native/wt/native__docs-sheets-editors/Sources/RastrilloApple/NativeConnection.swift:1:8: error: no such module 'Combine' 1 | import Combine | `- error: no such module 'Combine' 2 | import CryptoKit 3 | import Foundation [10/27] Compiling RastrilloApple NativeSignInView.swift /home/paulca/.local/state/amadan/runner/repos/rastrillo__native/wt/native__docs-sheets-editors/Sources/RastrilloApple/NativeConnection.swift:1:8: error: no such module 'Combine' 1 | import Combine | `- error: no such module 'Combine' 2 | import CryptoKit 3 | import Foundation [11/27] Compiling RastrilloApple NativeStreamLines.swift /home/paulca/.local/state/amadan/runner/repos/rastrillo__native/wt/native__docs-sheets-editors/Sources/RastrilloApple/NativeConnection.swift:1:8: error: no such module 'Combine' 1 | import Combine | `- error: no such module 'Combine' 2 | import CryptoKit 3 | import Foundation [12/27] Compiling RastrilloApple NativeResponse.swift /home/paulca/.local/state/amadan/runner/repos/rastrillo__native/wt/native__docs-sheets-editors/Sources/RastrilloApple/NativeConnection.swift:1:8: error: no such module 'Combine' 1 | import Combine | `- error: no such module 'Combine' 2 | import CryptoKit 3 | import Foundation [12/27] Wrapping AST for RastrilloNative for debugging [14/29] Emitting module RastrilloNativeTests [15/29] Compiling RastrilloNativeTests CoalescedRunnerTests.swift error: emit-module command failed with exit code 1 (use -v to see invocation) [17/30] Emitting module RastrilloApple /home/paulca/.local/state/amadan/runner/repos/rastrillo__native/wt/native__docs-sheets-editors/Sources/RastrilloApple/NativeConnection.swift:1:8: error: no such module 'Combine' 1 | import Combine | `- error: no such module 'Combine' 2 | import CryptoKit 3 | import Foundation [18/30] Compiling RastrilloApple NativeCredentials.swift /home/paulca/.local/state/amadan/runner/repos/rastrillo__native/wt/native__docs-sheets-editors/Sources/RastrilloApple/NativeConnection.swift:1:8: error: no such module 'Combine' 1 | import Combine | `- error: no such module 'Combine' 2 | import CryptoKit 3 | import Foundation [19/30] Compiling RastrilloApple NativeConnection.swift /home/paulca/.local/state/amadan/runner/repos/rastrillo__native/wt/native__docs-sheets-editors/Sources/RastrilloApple/NativeConnection.swift:1:8: error: no such module 'Combine' 1 | import Combine | `- error: no such module 'Combine' 2 | import CryptoKit 3 | import Foundation [19/30] Wrapping AST for RastrilloNativeTests for debugging error: fatalError make: *** [Makefile:4: test] Error 1 amadan: step test failed: exit status 2 amadan: job failed at step test — its output is above, not at the tail of this log
Watching for changes…