CI failed 4s
- Runner
claude~paul@keymail.dev/DOCS-T1- Reported by
claude~paul@keymail.dev/DOCS-T1- Queued
- Started
- Waited for a runner
- 8s
- Last change
- Attempt
- 1 of 2
Steps run in order, one after another.
-
vet passed
go vet ./...
-
fmt passed
No output.
-
test failed 4s
go test ./... ? amadan.net/oficina/memoria/cmd/memoria [no test files] --- FAIL: TestWiringPrunesOldCounters (0.01s) testing.go:1464: TempDir RemoveAll cleanup: unlinkat /tmp/TestWiringPrunesOldCounters807912468/001: directory not empty FAIL FAIL amadan.net/oficina/memoria/internal/memoria 3.245s ok amadan.net/oficina/memoria/internal/memoria/chunk (cached) ok amadan.net/oficina/memoria/internal/memoria/fact (cached) ? amadan.net/oficina/memoria/internal/memoria/icons [no test files] ok amadan.net/oficina/memoria/internal/memoria/index (cached) ok amadan.net/oficina/memoria/internal/memoria/notion (cached) ok amadan.net/oficina/memoria/internal/memoria/provider (cached) ok amadan.net/oficina/memoria/internal/memoria/query (cached) ok amadan.net/oficina/memoria/internal/memoria/seal (cached) ok amadan.net/oficina/memoria/internal/memoria/sibling (cached) ok amadan.net/oficina/memoria/internal/memoriatest 1.593s ? amadan.net/oficina/memoria/scripts/writeestilo [no test files] ? amadan.net/oficina/memoria/tools/bench [no test files] ? amadan.net/oficina/memoria/tools/drive [no test files] ? amadan.net/oficina/memoria/tools/seed [no test files] ? amadan.net/oficina/memoria/tools/vendorassets [no test files] FAIL make: *** [Makefile:62: test] Error 1 amadan: step test failed: exit status 2 -
migration-check not run
No output.
Whole run log
=== vet ===
go vet ./...
=== fmt ===
=== test ===
go test ./...
? amadan.net/oficina/memoria/cmd/memoria [no test files]
--- FAIL: TestWiringPrunesOldCounters (0.01s)
testing.go:1464: TempDir RemoveAll cleanup: unlinkat /tmp/TestWiringPrunesOldCounters807912468/001: directory not empty
FAIL
FAIL amadan.net/oficina/memoria/internal/memoria 3.245s
ok amadan.net/oficina/memoria/internal/memoria/chunk (cached)
ok amadan.net/oficina/memoria/internal/memoria/fact (cached)
? amadan.net/oficina/memoria/internal/memoria/icons [no test files]
ok amadan.net/oficina/memoria/internal/memoria/index (cached)
ok amadan.net/oficina/memoria/internal/memoria/notion (cached)
ok amadan.net/oficina/memoria/internal/memoria/provider (cached)
ok amadan.net/oficina/memoria/internal/memoria/query (cached)
ok amadan.net/oficina/memoria/internal/memoria/seal (cached)
ok amadan.net/oficina/memoria/internal/memoria/sibling (cached)
ok amadan.net/oficina/memoria/internal/memoriatest 1.593s
? amadan.net/oficina/memoria/scripts/writeestilo [no test files]
? amadan.net/oficina/memoria/tools/bench [no test files]
? amadan.net/oficina/memoria/tools/drive [no test files]
? amadan.net/oficina/memoria/tools/seed [no test files]
? amadan.net/oficina/memoria/tools/vendorassets [no test files]
FAIL
make: *** [Makefile:62: test] Error 1
amadan: step test failed: exit status 2
amadan: job failed at step test — its output is above, not at the tail of this log
Watching for changes…