CI failed 8s
- Runner
claude~paul@keymail.dev/DOCS-T1- Reported by
claude~paul@keymail.dev/DOCS-T1- Queued
- Started
- Waited for a runner
- 3s
- Last change
- Attempt
- 1 of 2
Steps run in order, one after another.
-
vet passed
go vet ./...
-
fmt passed 1s
No output.
-
test failed 7s
go test ./... ? amadan.net/oficina/memoria/cmd/memoria [no test files] --- FAIL: TestCreditsMatchProductionDependencies (0.12s) credits_inventory_test.go:36: production dependency graph unavailable exit status 1 FAIL FAIL amadan.net/oficina/memoria/internal/memoria 6.288s ok amadan.net/oficina/memoria/internal/memoria/chunk (cached) ok amadan.net/oficina/memoria/internal/memoria/fact 1.110s ? amadan.net/oficina/memoria/internal/memoria/icons [no test files] ok amadan.net/oficina/memoria/internal/memoria/index (cached) ok amadan.net/oficina/memoria/internal/memoria/notion (cached) ok amadan.net/oficina/memoria/internal/memoria/provider 1.206s ok amadan.net/oficina/memoria/internal/memoria/query (cached) ok amadan.net/oficina/memoria/internal/memoria/seal (cached) ok amadan.net/oficina/memoria/internal/memoria/sibling (cached) ok amadan.net/oficina/memoria/internal/memoriatest 3.191s ? amadan.net/oficina/memoria/tools/bench [no test files] ? amadan.net/oficina/memoria/tools/drive [no test files] ? amadan.net/oficina/memoria/tools/seed [no test files] ? amadan.net/oficina/memoria/tools/vendorassets [no test files] FAIL make: *** [Makefile:62: test] Error 1 amadan: step test failed: exit status 2 -
migration-check not run
No output.
Whole run log
=== vet ===
go vet ./...
=== fmt ===
=== test ===
go test ./...
? amadan.net/oficina/memoria/cmd/memoria [no test files]
--- FAIL: TestCreditsMatchProductionDependencies (0.12s)
credits_inventory_test.go:36: production dependency graph unavailable exit status 1
FAIL
FAIL amadan.net/oficina/memoria/internal/memoria 6.288s
ok amadan.net/oficina/memoria/internal/memoria/chunk (cached)
ok amadan.net/oficina/memoria/internal/memoria/fact 1.110s
? amadan.net/oficina/memoria/internal/memoria/icons [no test files]
ok amadan.net/oficina/memoria/internal/memoria/index (cached)
ok amadan.net/oficina/memoria/internal/memoria/notion (cached)
ok amadan.net/oficina/memoria/internal/memoria/provider 1.206s
ok amadan.net/oficina/memoria/internal/memoria/query (cached)
ok amadan.net/oficina/memoria/internal/memoria/seal (cached)
ok amadan.net/oficina/memoria/internal/memoria/sibling (cached)
ok amadan.net/oficina/memoria/internal/memoriatest 3.191s
? amadan.net/oficina/memoria/tools/bench [no test files]
? amadan.net/oficina/memoria/tools/drive [no test files]
? amadan.net/oficina/memoria/tools/seed [no test files]
? amadan.net/oficina/memoria/tools/vendorassets [no test files]
FAIL
make: *** [Makefile:62: test] Error 1
amadan: step test failed: exit status 2
amadan: job failed at step test — its output is above, not at the tail of this log
Watching for changes…