CI failed 3s
- Runner
claude~paul@keymail.dev/DOCS-T1- Reported by
claude~paul@keymail.dev/DOCS-T1- Queued
- Started
- Waited for a runner
- 2s
- Last change
- Attempt
- 1 of 2
Steps run in order, one after another.
-
vet passed 1s
go vet ./...
-
fmt passed
No output.
-
test failed 2s
go test ./... ? amadan.net/oficina/memoria/cmd/memoria [no test files] --- FAIL: TestCreditsMatchProductionDependencies (0.03s) credits_inventory_test.go:36: production dependency graph unavailable exit status 1 FAIL FAIL amadan.net/oficina/memoria/internal/memoria 0.707s ok amadan.net/oficina/memoria/internal/memoria/chunk (cached) ok amadan.net/oficina/memoria/internal/memoria/fact 0.336s ? amadan.net/oficina/memoria/internal/memoria/icons [no test files] ok amadan.net/oficina/memoria/internal/memoria/index (cached) ok amadan.net/oficina/memoria/internal/memoria/notion (cached) ok amadan.net/oficina/memoria/internal/memoria/query (cached) ok amadan.net/oficina/memoria/internal/memoria/seal (cached) ok amadan.net/oficina/memoria/internal/memoria/sibling (cached) ok amadan.net/oficina/memoria/internal/memoriatest 1.553s ? amadan.net/oficina/memoria/tools/bench [no test files] ? amadan.net/oficina/memoria/tools/drive [no test files] ? amadan.net/oficina/memoria/tools/seed [no test files] ? amadan.net/oficina/memoria/tools/vendorassets [no test files] FAIL make: *** [Makefile:62: test] Error 1 amadan: step test failed: exit status 2 -
migration-check not run
No output.
Whole run log
=== vet ===
go vet ./...
=== fmt ===
=== test ===
go test ./...
? amadan.net/oficina/memoria/cmd/memoria [no test files]
--- FAIL: TestCreditsMatchProductionDependencies (0.03s)
credits_inventory_test.go:36: production dependency graph unavailable exit status 1
FAIL
FAIL amadan.net/oficina/memoria/internal/memoria 0.707s
ok amadan.net/oficina/memoria/internal/memoria/chunk (cached)
ok amadan.net/oficina/memoria/internal/memoria/fact 0.336s
? amadan.net/oficina/memoria/internal/memoria/icons [no test files]
ok amadan.net/oficina/memoria/internal/memoria/index (cached)
ok amadan.net/oficina/memoria/internal/memoria/notion (cached)
ok amadan.net/oficina/memoria/internal/memoria/query (cached)
ok amadan.net/oficina/memoria/internal/memoria/seal (cached)
ok amadan.net/oficina/memoria/internal/memoria/sibling (cached)
ok amadan.net/oficina/memoria/internal/memoriatest 1.553s
? amadan.net/oficina/memoria/tools/bench [no test files]
? amadan.net/oficina/memoria/tools/drive [no test files]
? amadan.net/oficina/memoria/tools/seed [no test files]
? amadan.net/oficina/memoria/tools/vendorassets [no test files]
FAIL
make: *** [Makefile:62: test] Error 1
amadan: step test failed: exit status 2
amadan: job failed at step test — its output is above, not at the tail of this log
Watching for changes…