CI failed 45s
- Branch
fix/keymail-signin- Commit
dde2c125Claude
- Runner
claude~paul@keymail.dev/DOCS-T1- Reported by
claude~paul@keymail.dev/DOCS-T1- Queued
- Started
- Waited for a runner
- 2s
- Last change
- Attempt
- 1 of 2
Steps run in order, one after another.
-
vet passed
go vet ./...
-
fmt passed
No output.
-
test passed 11s
go test ./... ok amadan.net/oficina/calls/callscore (cached) ? amadan.net/oficina/calls/cmd/calls [no test files] ok amadan.net/oficina/calls/cmd/quality-summary (cached) ok amadan.net/oficina/calls/internal/calls 1.937s ok amadan.net/oficina/calls/internal/calls/apns (cached) ok amadan.net/oficina/calls/internal/calls/hub (cached) ? amadan.net/oficina/calls/internal/calls/icons [no test files] ? amadan.net/oficina/calls/internal/calls/keymailtest [no test files] ok amadan.net/oficina/calls/internal/calls/relay (cached) ok amadan.net/oficina/calls/internal/calls/seal (cached) ok amadan.net/oficina/calls/internal/callstest 9.965s ? amadan.net/oficina/calls/protocol [no test files] ? amadan.net/oficina/calls/scripts/writeestilo [no test files]
-
migration-check passed 1s
go run amadan.net/rastrillo/rastrillo/cmd/rastrillo migration check rastrillo migration check: models and migrations agree
-
race failed 32s
CGO_ENABLED=1 go test -race ./internal/... 2026/10/06 20:31:47 INFO migrate applied="[sessions/0001_init auth/0001_init auth/0002_sessions_backfill calls/0001_init calls/0002_agents calls/0003_alter_meeting_links calls/0004_alter_persons calls/0005_create_device_tokens calls/0006_alter_meetings]" skipped=0 adopted=false 2026/10/06 20:31:47 INFO migrate applied="[sessions/0001_init auth/0001_init auth/0002_sessions_backfill calls/0001_init calls/0002_agents calls/0003_alter_meeting_links calls/0004_alter_persons calls/0005_create_device_tokens calls/0006_alter_meetings]" skipped=0 adopted=false 2026/10/06 20:31:47 INFO migrate applied="[sessions/0001_init auth/0001_init auth/0002_sessions_backfill calls/0001_init calls/0002_agents calls/0003_alter_meeting_links calls/0004_alter_persons calls/0005_create_device_tokens calls/0006_alter_meetings]" skipped=0 adopted=false --- FAIL: TestMemberAndOutsiderDoTheSameWorkOverBudget (0.10s) signin_equal_work_test.go:115: member did 6 statements and 0 log lines, outsider 3 and 0: want the same work and no log line on the response path FAIL FAIL amadan.net/oficina/calls/internal/calls 11.185s ok amadan.net/oficina/calls/internal/calls/apns (cached) ok amadan.net/oficina/calls/internal/calls/hub (cached) ? amadan.net/oficina/calls/internal/calls/icons [no test files] ? amadan.net/oficina/calls/internal/calls/keymailtest [no test files] ok amadan.net/oficina/calls/internal/calls/relay (cached) ok amadan.net/oficina/calls/internal/calls/seal (cached) ok amadan.net/oficina/calls/internal/callstest 29.728s FAIL make: *** [Makefile:79: race] Error 1 amadan: step race failed: exit status 2
Whole run log
=== vet ===
go vet ./...
=== fmt ===
=== test ===
go test ./...
ok amadan.net/oficina/calls/callscore (cached)
? amadan.net/oficina/calls/cmd/calls [no test files]
ok amadan.net/oficina/calls/cmd/quality-summary (cached)
ok amadan.net/oficina/calls/internal/calls 1.937s
ok amadan.net/oficina/calls/internal/calls/apns (cached)
ok amadan.net/oficina/calls/internal/calls/hub (cached)
? amadan.net/oficina/calls/internal/calls/icons [no test files]
? amadan.net/oficina/calls/internal/calls/keymailtest [no test files]
ok amadan.net/oficina/calls/internal/calls/relay (cached)
ok amadan.net/oficina/calls/internal/calls/seal (cached)
ok amadan.net/oficina/calls/internal/callstest 9.965s
? amadan.net/oficina/calls/protocol [no test files]
? amadan.net/oficina/calls/scripts/writeestilo [no test files]
=== migration-check ===
go run amadan.net/rastrillo/rastrillo/cmd/rastrillo migration check
rastrillo migration check: models and migrations agree
=== race ===
CGO_ENABLED=1 go test -race ./internal/...
2026/10/06 20:31:47 INFO migrate applied="[sessions/0001_init auth/0001_init auth/0002_sessions_backfill calls/0001_init calls/0002_agents calls/0003_alter_meeting_links calls/0004_alter_persons calls/0005_create_device_tokens calls/0006_alter_meetings]" skipped=0 adopted=false
2026/10/06 20:31:47 INFO migrate applied="[sessions/0001_init auth/0001_init auth/0002_sessions_backfill calls/0001_init calls/0002_agents calls/0003_alter_meeting_links calls/0004_alter_persons calls/0005_create_device_tokens calls/0006_alter_meetings]" skipped=0 adopted=false
2026/10/06 20:31:47 INFO migrate applied="[sessions/0001_init auth/0001_init auth/0002_sessions_backfill calls/0001_init calls/0002_agents calls/0003_alter_meeting_links calls/0004_alter_persons calls/0005_create_device_tokens calls/0006_alter_meetings]" skipped=0 adopted=false
--- FAIL: TestMemberAndOutsiderDoTheSameWorkOverBudget (0.10s)
signin_equal_work_test.go:115: member did 6 statements and 0 log lines, outsider 3 and 0: want the same work and no log line on the response path
FAIL
FAIL amadan.net/oficina/calls/internal/calls 11.185s
ok amadan.net/oficina/calls/internal/calls/apns (cached)
ok amadan.net/oficina/calls/internal/calls/hub (cached)
? amadan.net/oficina/calls/internal/calls/icons [no test files]
? amadan.net/oficina/calls/internal/calls/keymailtest [no test files]
ok amadan.net/oficina/calls/internal/calls/relay (cached)
ok amadan.net/oficina/calls/internal/calls/seal (cached)
ok amadan.net/oficina/calls/internal/callstest 29.728s
FAIL
make: *** [Makefile:79: race] Error 1
amadan: step race failed: exit status 2
amadan: job failed at step race — its output is above, not at the tail of this log
Watching for changes…