CI failed 44s
- Runner
claude~paul@keymail.dev/DOCS-T1- Reported by
claude~paul@keymail.dev/DOCS-T1- Queued
- Started
- Waited for a runner
- 1m 10s
- Last change
- Attempt
- 1 of 2
Steps run in order, one after another.
-
vet passed 2s
CGO_ENABLED=0 go vet ./... CGO_ENABLED=0 go vet -tags browser ./internal/home/ cd handoff && CGO_ENABLED=0 go vet ./... cd roster && CGO_ENABLED=0 go vet ./... cd connect && CGO_ENABLED=0 go vet ./...
-
fmt passed
No output.
-
build passed 2s
CGO_ENABLED=0 go build ./... CGO_ENABLED=0 GOOS=linux GOARCH=arm64 go build ./cmd/home ./cmd/oficina ./internal/operatorlaunch cd handoff && CGO_ENABLED=0 go build ./... cd roster && CGO_ENABLED=0 go build ./... cd connect && CGO_ENABLED=0 go build ./...
-
go-test failed 40s
CGO_ENABLED=0 go test -count=1 ./... ? amadan.net/oficina/home/cmd/home [no test files] ok amadan.net/oficina/home/cmd/home-placeholder 0.601s ? amadan.net/oficina/home/cmd/oficina [no test files] ok amadan.net/oficina/home/internal/guardstest 0.038s --- FAIL: TestOperatorCommandCredentialPrivateAtomicReplay (0.02s) operator_command_linux_test.go:231: too many open files --- FAIL: TestOperatorCommandRefusesBeforeDatabaseOpen (0.09s) --- FAIL: TestOperatorCommandRefusesBeforeDatabaseOpen/signer (0.02s) operator_command_linux_test.go:289: too many open files --- FAIL: TestOperatorCommandRefusesBeforeDatabaseOpen/missing-material (0.02s) operator_command_linux_test.go:289: too many open files --- FAIL: TestOperatorCommandRefusesBeforeDatabaseOpen/unknown-material (0.02s) operator_command_linux_test.go:289: too many open files --- FAIL: TestOperatorCommandRefusesBeforeDatabaseOpen/wrong-role (0.02s) operator_command_linux_test.go:289: too many open files --- FAIL: TestOperatorCommandDirectoryInspectAndSeed (0.02s) operator_command_linux_test.go:305: too many open files --- FAIL: TestOperatorCommandOutputFailureRecoversCommittedResult (0.04s) --- FAIL: TestOperatorCommandOutputFailureRecoversCommittedResult/closed-pipe (0.02s) operator_command_linux_test.go:370: too many open files --- FAIL: TestOperatorCommandOutputFailureRecoversCommittedResult/regular-file (0.02s) operator_command_linux_test.go:370: too many open files --- FAIL: TestOperatorCommandSchemaRefusalMakesNoIdentity (0.06s) --- FAIL: TestOperatorCommandSchemaRefusalMakesNoIdentity/DELETE_FROM_rastrillo_migrations_WHERE_id=(SELECT_id_FROM_rastrillo_migrations_LIMIT_1) (0.02s) operator_command_linux_test.go:410: too many open files --- FAIL: TestOperatorCommandSchemaRefusalMakesNoIdentity/CREATE_TRIGGER_unexpected_AFTER_INSERT_ON_people_BEGIN_SELECT_1;_END (0.02s) operator_command_linux_test.go:410: too many open files --- FAIL: TestOperatorCommandSchemaRefusalMakesNoIdentity/CREATE_TABLE_unexpected(value_TEXT) (0.02s) operator_command_linux_test.go:410: too many open files --- FAIL: TestOperatorCommandActualBinaryDispatch (0.60s) operator_command_linux_test.go:446: too many open files --- FAIL: TestOperatorCommandKeyAndScopeCollisionsRefuseBeforeOpen (0.12s) --- FAIL: TestOperatorCommandKeyAndScopeCollisionsRefuseBeforeOpen/mac-dek (0.02s) operator_command_linux_test.go:491: too many open files --- FAIL: TestOperatorCommandKeyAndScopeCollisionsRefuseBeforeOpen/zero-mac (0.02s) operator_command_linux_test.go:491: too many open files --- FAIL: TestOperatorCommandKeyAndScopeCollisionsRefuseBeforeOpen/owner-browser (0.02s) operator_command_linux_test.go:491: too many open files --- FAIL: TestOperatorCommandKeyAndScopeCollisionsRefuseBeforeOpen/owner-authorizer (0.02s) operator_command_linux_test.go:491: too many open files --- FAIL: TestOperatorCommandKeyAndScopeCollisionsRefuseBeforeOpen/pinned-origin (0.02s) operator_command_linux_test.go:491: too many open files --- FAIL: TestOperatorCommandKeyAndScopeCollisionsRefuseBeforeOpen/pinned-role (0.02s) operator_command_linux_test.go:491: too many open files FAIL FAIL amadan.net/oficina/home/internal/home 10.327s ok amadan.net/oficina/home/internal/home/directorydata 0.949s ok amadan.net/oficina/home/internal/home/logtest 0.004s ok amadan.net/oficina/home/internal/home/seal 0.002s ok amadan.net/oficina/home/internal/home/sealtest 0.003s --- FAIL: TestCommandInvocationBindsSignatureBeforeOpeningDatabase (0.17s) --- FAIL: TestCommandInvocationBindsSignatureBeforeOpeningDatabase/valid (0.01s) command_linux_test.go:184: too many open files --- FAIL: TestCommandInvocationBindsSignatureBeforeOpeningDatabase/runtime-default (0.01s) command_linux_test.go:184: too many open files --- FAIL: TestCommandInvocationBindsSignatureBeforeOpeningDatabase/swap-before-close (0.01s) command_linux_test.go:184: too many open files --- FAIL: TestCommandInvocationBindsSignatureBeforeOpeningDatabase/deadline-before-close (0.01s) command_linux_test.go:184: too many open files --- FAIL: TestCommandInvocationBindsSignatureBeforeOpeningDatabase/expired-authentic (0.01s) command_linux_test.go:184: too many open files --- FAIL: TestCommandInvocationBindsSignatureBeforeOpeningDatabase/signer (0.01s) command_linux_test.go:184: too many open files --- FAIL: TestCommandInvocationBindsSignatureBeforeOpeningDatabase/origin (0.01s) command_linux_test.go:184: too many open files --- FAIL: TestCommandInvocationBindsSignatureBeforeOpeningDatabase/registry (0.01s) command_linux_test.go:184: too many open files --- FAIL: TestCommandInvocationBindsSignatureBeforeOpeningDatabase/role (0.01s) command_linux_test.go:184: too many open files --- FAIL: TestCommandInvocationBindsSignatureBeforeOpeningDatabase/action (0.01s) command_linux_test.go:184: too many open files --- FAIL: TestCommandInvocationBindsSignatureBeforeOpeningDatabase/config-key (0.01s) command_linux_test.go:184: too many open files --- FAIL: TestCommandInvocationBindsSignatureBeforeOpeningDatabase/transport-account (0.01s) command_linux_test.go:184: too many open files --- FAIL: TestCommandInvocationBindsSignatureBeforeOpeningDatabase/transport-app (0.01s) command_linux_test.go:184: too many open files --- FAIL: TestCommandInvocationBindsSignatureBeforeOpeningDatabase/transport-host (0.01s) command_linux_test.go:184: too many open files --- FAIL: TestCommandInvocationBindsSignatureBeforeOpeningDatabase/inode (0.01s) command_linux_test.go:184: too many open files FAIL FAIL amadan.net/oficina/home/internal/operator 0.799s ok amadan.net/oficina/home/internal/operatorlaunch 4.110s ok amadan.net/oficina/home/internal/provisioner 38.502s FAIL make: *** [Makefile:108: test-go] Error 1 amadan: step go-test failed: exit status 2 -
race not run
No output.
Whole run log
amadan: .amadan/timeout: this job's budget is 15m0s (this runner allows up to 30m0s)
=== vet ===
CGO_ENABLED=0 go vet ./...
CGO_ENABLED=0 go vet -tags browser ./internal/home/
cd handoff && CGO_ENABLED=0 go vet ./...
cd roster && CGO_ENABLED=0 go vet ./...
cd connect && CGO_ENABLED=0 go vet ./...
=== fmt ===
=== build ===
CGO_ENABLED=0 go build ./...
CGO_ENABLED=0 GOOS=linux GOARCH=arm64 go build ./cmd/home ./cmd/oficina ./internal/operatorlaunch
cd handoff && CGO_ENABLED=0 go build ./...
cd roster && CGO_ENABLED=0 go build ./...
cd connect && CGO_ENABLED=0 go build ./...
=== go-test ===
CGO_ENABLED=0 go test -count=1 ./...
? amadan.net/oficina/home/cmd/home [no test files]
ok amadan.net/oficina/home/cmd/home-placeholder 0.601s
? amadan.net/oficina/home/cmd/oficina [no test files]
ok amadan.net/oficina/home/internal/guardstest 0.038s
--- FAIL: TestOperatorCommandCredentialPrivateAtomicReplay (0.02s)
operator_command_linux_test.go:231: too many open files
--- FAIL: TestOperatorCommandRefusesBeforeDatabaseOpen (0.09s)
--- FAIL: TestOperatorCommandRefusesBeforeDatabaseOpen/signer (0.02s)
operator_command_linux_test.go:289: too many open files
--- FAIL: TestOperatorCommandRefusesBeforeDatabaseOpen/missing-material (0.02s)
operator_command_linux_test.go:289: too many open files
--- FAIL: TestOperatorCommandRefusesBeforeDatabaseOpen/unknown-material (0.02s)
operator_command_linux_test.go:289: too many open files
--- FAIL: TestOperatorCommandRefusesBeforeDatabaseOpen/wrong-role (0.02s)
operator_command_linux_test.go:289: too many open files
--- FAIL: TestOperatorCommandDirectoryInspectAndSeed (0.02s)
operator_command_linux_test.go:305: too many open files
--- FAIL: TestOperatorCommandOutputFailureRecoversCommittedResult (0.04s)
--- FAIL: TestOperatorCommandOutputFailureRecoversCommittedResult/closed-pipe (0.02s)
operator_command_linux_test.go:370: too many open files
--- FAIL: TestOperatorCommandOutputFailureRecoversCommittedResult/regular-file (0.02s)
operator_command_linux_test.go:370: too many open files
--- FAIL: TestOperatorCommandSchemaRefusalMakesNoIdentity (0.06s)
--- FAIL: TestOperatorCommandSchemaRefusalMakesNoIdentity/DELETE_FROM_rastrillo_migrations_WHERE_id=(SELECT_id_FROM_rastrillo_migrations_LIMIT_1) (0.02s)
operator_command_linux_test.go:410: too many open files
--- FAIL: TestOperatorCommandSchemaRefusalMakesNoIdentity/CREATE_TRIGGER_unexpected_AFTER_INSERT_ON_people_BEGIN_SELECT_1;_END (0.02s)
operator_command_linux_test.go:410: too many open files
--- FAIL: TestOperatorCommandSchemaRefusalMakesNoIdentity/CREATE_TABLE_unexpected(value_TEXT) (0.02s)
operator_command_linux_test.go:410: too many open files
--- FAIL: TestOperatorCommandActualBinaryDispatch (0.60s)
operator_command_linux_test.go:446: too many open files
--- FAIL: TestOperatorCommandKeyAndScopeCollisionsRefuseBeforeOpen (0.12s)
--- FAIL: TestOperatorCommandKeyAndScopeCollisionsRefuseBeforeOpen/mac-dek (0.02s)
operator_command_linux_test.go:491: too many open files
--- FAIL: TestOperatorCommandKeyAndScopeCollisionsRefuseBeforeOpen/zero-mac (0.02s)
operator_command_linux_test.go:491: too many open files
--- FAIL: TestOperatorCommandKeyAndScopeCollisionsRefuseBeforeOpen/owner-browser (0.02s)
operator_command_linux_test.go:491: too many open files
--- FAIL: TestOperatorCommandKeyAndScopeCollisionsRefuseBeforeOpen/owner-authorizer (0.02s)
operator_command_linux_test.go:491: too many open files
--- FAIL: TestOperatorCommandKeyAndScopeCollisionsRefuseBeforeOpen/pinned-origin (0.02s)
operator_command_linux_test.go:491: too many open files
--- FAIL: TestOperatorCommandKeyAndScopeCollisionsRefuseBeforeOpen/pinned-role (0.02s)
operator_command_linux_test.go:491: too many open files
FAIL
FAIL amadan.net/oficina/home/internal/home 10.327s
ok amadan.net/oficina/home/internal/home/directorydata 0.949s
ok amadan.net/oficina/home/internal/home/logtest 0.004s
ok amadan.net/oficina/home/internal/home/seal 0.002s
ok amadan.net/oficina/home/internal/home/sealtest 0.003s
--- FAIL: TestCommandInvocationBindsSignatureBeforeOpeningDatabase (0.17s)
--- FAIL: TestCommandInvocationBindsSignatureBeforeOpeningDatabase/valid (0.01s)
command_linux_test.go:184: too many open files
--- FAIL: TestCommandInvocationBindsSignatureBeforeOpeningDatabase/runtime-default (0.01s)
command_linux_test.go:184: too many open files
--- FAIL: TestCommandInvocationBindsSignatureBeforeOpeningDatabase/swap-before-close (0.01s)
command_linux_test.go:184: too many open files
--- FAIL: TestCommandInvocationBindsSignatureBeforeOpeningDatabase/deadline-before-close (0.01s)
command_linux_test.go:184: too many open files
--- FAIL: TestCommandInvocationBindsSignatureBeforeOpeningDatabase/expired-authentic (0.01s)
command_linux_test.go:184: too many open files
--- FAIL: TestCommandInvocationBindsSignatureBeforeOpeningDatabase/signer (0.01s)
command_linux_test.go:184: too many open files
--- FAIL: TestCommandInvocationBindsSignatureBeforeOpeningDatabase/origin (0.01s)
command_linux_test.go:184: too many open files
--- FAIL: TestCommandInvocationBindsSignatureBeforeOpeningDatabase/registry (0.01s)
command_linux_test.go:184: too many open files
--- FAIL: TestCommandInvocationBindsSignatureBeforeOpeningDatabase/role (0.01s)
command_linux_test.go:184: too many open files
--- FAIL: TestCommandInvocationBindsSignatureBeforeOpeningDatabase/action (0.01s)
command_linux_test.go:184: too many open files
--- FAIL: TestCommandInvocationBindsSignatureBeforeOpeningDatabase/config-key (0.01s)
command_linux_test.go:184: too many open files
--- FAIL: TestCommandInvocationBindsSignatureBeforeOpeningDatabase/transport-account (0.01s)
command_linux_test.go:184: too many open files
--- FAIL: TestCommandInvocationBindsSignatureBeforeOpeningDatabase/transport-app (0.01s)
command_linux_test.go:184: too many open files
--- FAIL: TestCommandInvocationBindsSignatureBeforeOpeningDatabase/transport-host (0.01s)
command_linux_test.go:184: too many open files
--- FAIL: TestCommandInvocationBindsSignatureBeforeOpeningDatabase/inode (0.01s)
command_linux_test.go:184: too many open files
FAIL
FAIL amadan.net/oficina/home/internal/operator 0.799s
ok amadan.net/oficina/home/internal/operatorlaunch 4.110s
ok amadan.net/oficina/home/internal/provisioner 38.502s
FAIL
make: *** [Makefile:108: test-go] Error 1
amadan: step go-test failed: exit status 2
amadan: job failed at step go-test — its output is above, not at the tail of this log
Watching for changes…