oficina / home Public

CI failed 5m 28s

Branch
main
Commit
305862a2 Claude
Runner
claude~paul@keymail.dev/DOCS-T1
Reported by
claude~paul@keymail.dev/DOCS-T1
Queued
Started
Waited for a runner
6m 25s
Last change
Attempt
1 of 2

Steps run in order, one after another.

  1. vet passed
    CGO_ENABLED=0 go vet ./...
    cd handoff && CGO_ENABLED=0 go vet ./...
    cd roster && CGO_ENABLED=0 go vet ./...
    cd connect && CGO_ENABLED=0 go vet ./...
    
  2. fmt passed

    No output.

  3. build passed 2s
    CGO_ENABLED=0 go build ./...
    CGO_ENABLED=0 GOOS=linux GOARCH=arm64 go build ./cmd/home ./cmd/oficina ./internal/operatorlaunch
    cd handoff && CGO_ENABLED=0 go build ./...
    cd roster && CGO_ENABLED=0 go build ./...
    cd connect && CGO_ENABLED=0 go build ./...
    
  4. go-test passed 48s
    CGO_ENABLED=0 go test -count=1 ./...
    ?   	amadan.net/oficina/home/cmd/home	[no test files]
    ok  	amadan.net/oficina/home/cmd/home-placeholder	0.509s
    ?   	amadan.net/oficina/home/cmd/oficina	[no test files]
    ok  	amadan.net/oficina/home/internal/guardstest	0.028s
    ok  	amadan.net/oficina/home/internal/home	8.067s
    ok  	amadan.net/oficina/home/internal/home/directorydata	0.977s
    ok  	amadan.net/oficina/home/internal/home/logtest	0.005s
    ok  	amadan.net/oficina/home/internal/home/seal	0.004s
    ok  	amadan.net/oficina/home/internal/home/sealtest	0.004s
    ok  	amadan.net/oficina/home/internal/operator	5.041s
    ok  	amadan.net/oficina/home/internal/operatorlaunch	4.149s
    ok  	amadan.net/oficina/home/internal/provisioner	40.529s
    cd handoff && CGO_ENABLED=0 go test -count=1 ./...
    ok  	amadan.net/oficina/home/handoff	0.327s
    ok  	amadan.net/oficina/home/handoff/seal	0.002s
    cd roster && CGO_ENABLED=0 go test -count=1 ./...
    ok  	amadan.net/oficina/home/roster	5.077s
    cd connect && CGO_ENABLED=0 go test -count=1 ./...
    ok  	amadan.net/oficina/home/connect	0.083s
    ok  	amadan.net/oficina/home/connect/linkstore	0.271s
    
  5. race failed 4m 38s
    go test -race -count=1 ./internal/home/ ./internal/operator/ ./internal/operatorlaunch/ ./internal/provisioner/ ./internal/home/directorydata/
    --- FAIL: TestCompatibilityDatabaseSubprocess (36.50s)
        --- FAIL: TestCompatibilityDatabaseSubprocess/credential/valid (0.14s)
            compatibility_linux_test.go:253: child: exit status 1 --- FAIL: TestCompatibilityDatabaseSubprocess (0.02s)
                    compatibility_linux_test.go:173: operator: refused
                FAIL
    FAIL
    FAIL	amadan.net/oficina/home/internal/home	90.531s
    ok  	amadan.net/oficina/home/internal/operator	64.516s
    ok  	amadan.net/oficina/home/internal/operatorlaunch	22.390s
    ok  	amadan.net/oficina/home/internal/provisioner	274.753s
    ok  	amadan.net/oficina/home/internal/home/directorydata	18.056s
    FAIL
    make: *** [Makefile:108: test-race] Error 1
    
    amadan: step race failed: exit status 2
    
Whole run log
amadan: .amadan/timeout: this job's budget is 15m0s (this runner allows up to 30m0s)
=== vet ===
CGO_ENABLED=0 go vet ./...
cd handoff && CGO_ENABLED=0 go vet ./...
cd roster && CGO_ENABLED=0 go vet ./...
cd connect && CGO_ENABLED=0 go vet ./...
=== fmt ===
=== build ===
CGO_ENABLED=0 go build ./...
CGO_ENABLED=0 GOOS=linux GOARCH=arm64 go build ./cmd/home ./cmd/oficina ./internal/operatorlaunch
cd handoff && CGO_ENABLED=0 go build ./...
cd roster && CGO_ENABLED=0 go build ./...
cd connect && CGO_ENABLED=0 go build ./...
=== go-test ===
CGO_ENABLED=0 go test -count=1 ./...
?   	amadan.net/oficina/home/cmd/home	[no test files]
ok  	amadan.net/oficina/home/cmd/home-placeholder	0.509s
?   	amadan.net/oficina/home/cmd/oficina	[no test files]
ok  	amadan.net/oficina/home/internal/guardstest	0.028s
ok  	amadan.net/oficina/home/internal/home	8.067s
ok  	amadan.net/oficina/home/internal/home/directorydata	0.977s
ok  	amadan.net/oficina/home/internal/home/logtest	0.005s
ok  	amadan.net/oficina/home/internal/home/seal	0.004s
ok  	amadan.net/oficina/home/internal/home/sealtest	0.004s
ok  	amadan.net/oficina/home/internal/operator	5.041s
ok  	amadan.net/oficina/home/internal/operatorlaunch	4.149s
ok  	amadan.net/oficina/home/internal/provisioner	40.529s
cd handoff && CGO_ENABLED=0 go test -count=1 ./...
ok  	amadan.net/oficina/home/handoff	0.327s
ok  	amadan.net/oficina/home/handoff/seal	0.002s
cd roster && CGO_ENABLED=0 go test -count=1 ./...
ok  	amadan.net/oficina/home/roster	5.077s
cd connect && CGO_ENABLED=0 go test -count=1 ./...
ok  	amadan.net/oficina/home/connect	0.083s
ok  	amadan.net/oficina/home/connect/linkstore	0.271s
=== race ===
go test -race -count=1 ./internal/home/ ./internal/operator/ ./internal/operatorlaunch/ ./internal/provisioner/ ./internal/home/directorydata/
--- FAIL: TestCompatibilityDatabaseSubprocess (36.50s)
    --- FAIL: TestCompatibilityDatabaseSubprocess/credential/valid (0.14s)
        compatibility_linux_test.go:253: child: exit status 1 --- FAIL: TestCompatibilityDatabaseSubprocess (0.02s)
                compatibility_linux_test.go:173: operator: refused
            FAIL
FAIL
FAIL	amadan.net/oficina/home/internal/home	90.531s
ok  	amadan.net/oficina/home/internal/operator	64.516s
ok  	amadan.net/oficina/home/internal/operatorlaunch	22.390s
ok  	amadan.net/oficina/home/internal/provisioner	274.753s
ok  	amadan.net/oficina/home/internal/home/directorydata	18.056s
FAIL
make: *** [Makefile:108: test-race] Error 1

amadan: step race failed: exit status 2

amadan: job failed at step race — its output is above, not at the tail of this log