oficina / calendar Public

CI failed 9s

Branch
theme-calma
Commit
89cb8ab7 Paul Campbell
Runner
claude~paul@keymail.dev/DOCS-T1
Reported by
claude~paul@keymail.dev/DOCS-T1
Queued
Started
Waited for a runner
5s
Last change
Attempt
1 of 2

Steps run in order, one after another.

  1. vet passed 2s
    go vet ./...
    go: downloading amadan.net/oficina/estilo.git v0.0.0-20260929070530-5b2ce835e773
    
  2. fmt passed

    No output.

  3. test failed 7s
    go test ./...
    ?   	amadan.net/oficina/calendar/cmd/calendar	[no test files]
    --- FAIL: TestCreditsMatchProductionDependencies (0.04s)
        credits_inventory_test.go:35: production dependency graph unavailable exit status 1
    FAIL
    FAIL	amadan.net/oficina/calendar/internal/calendar	4.425s
    ?   	amadan.net/oficina/calendar/internal/calendar/icons	[no test files]
    ?   	amadan.net/oficina/calendar/internal/calendar/seal	[no test files]
    ok  	amadan.net/oficina/calendar/internal/calendartest	2.053s
    ok  	amadan.net/oficina/calendar/internal/guardstest	0.046s
    ?   	amadan.net/oficina/calendar/scripts/writetheme	[no test files]
    FAIL
    make: *** [Makefile:85: test] Error 1
    
    amadan: step test failed: exit status 2
    
  4. migration-check not run

    No output.

Whole run log
=== vet ===
go vet ./...
go: downloading amadan.net/oficina/estilo.git v0.0.0-20260929070530-5b2ce835e773
=== fmt ===
=== test ===
go test ./...
?   	amadan.net/oficina/calendar/cmd/calendar	[no test files]
--- FAIL: TestCreditsMatchProductionDependencies (0.04s)
    credits_inventory_test.go:35: production dependency graph unavailable exit status 1
FAIL
FAIL	amadan.net/oficina/calendar/internal/calendar	4.425s
?   	amadan.net/oficina/calendar/internal/calendar/icons	[no test files]
?   	amadan.net/oficina/calendar/internal/calendar/seal	[no test files]
ok  	amadan.net/oficina/calendar/internal/calendartest	2.053s
ok  	amadan.net/oficina/calendar/internal/guardstest	0.046s
?   	amadan.net/oficina/calendar/scripts/writetheme	[no test files]
FAIL
make: *** [Makefile:85: test] Error 1

amadan: step test failed: exit status 2

amadan: job failed at step test — its output is above, not at the tail of this log