oficina / calendar Public

CI failed 6s

Branch
main
Commit
7a1d2f64 Paul Campbell
Runner
claude~paul@keymail.dev/DOCS-T1
Reported by
claude~paul@keymail.dev/DOCS-T1
Queued
Started
Waited for a runner
4s
Last change
Attempt
1 of 2

Steps run in order, one after another.

  1. vet passed 1s
    go vet ./...
    
  2. fmt passed

    No output.

  3. test failed 5s
    go test ./...
    ?   	amadan.net/oficina/calendar/cmd/calendar	[no test files]
    ok  	amadan.net/oficina/calendar/internal/calendar	4.473s
    ?   	amadan.net/oficina/calendar/internal/calendar/icons	[no test files]
    ?   	amadan.net/oficina/calendar/internal/calendar/seal	[no test files]
    --- FAIL: TestPublicBookingPostRegistersItsHoldAndMail (0.03s)
        schedule_delivery_test.go:83: public booking did not register scheduled work: got 2026-09-23 09:46:43 +0000 UTC, expected 2026-09-23 11:11:43 +0100 IST
    2026/09/23 10:41:43 INFO migrate applied="[sessions/0001_init auth/0001_init auth/0002_sessions_backfill calendar/0001_create_people calendar/0002_alter_people calendar/0003_alter_reminders calendar/0004_create_attendees calendar/0005_alter_people calendar/0006_alter_reminder_queues]" skipped=0 adopted=false
    2026/09/23 10:41:43 ERROR calendar: scheduled work registration failed stage=schedule.register err="calendar: this platform does not support safe scheduled work; update the platform before starting Calendar"
    FAIL
    FAIL	amadan.net/oficina/calendar/internal/calendartest	2.915s
    ok  	amadan.net/oficina/calendar/internal/guardstest	0.047s
    FAIL
    make: *** [Makefile:85: test] Error 1
    
    amadan: step test failed: exit status 2
    
  4. migration-check not run

    No output.

Whole run log
=== vet ===
go vet ./...
=== fmt ===
=== test ===
go test ./...
?   	amadan.net/oficina/calendar/cmd/calendar	[no test files]
ok  	amadan.net/oficina/calendar/internal/calendar	4.473s
?   	amadan.net/oficina/calendar/internal/calendar/icons	[no test files]
?   	amadan.net/oficina/calendar/internal/calendar/seal	[no test files]
--- FAIL: TestPublicBookingPostRegistersItsHoldAndMail (0.03s)
    schedule_delivery_test.go:83: public booking did not register scheduled work: got 2026-09-23 09:46:43 +0000 UTC, expected 2026-09-23 11:11:43 +0100 IST
2026/09/23 10:41:43 INFO migrate applied="[sessions/0001_init auth/0001_init auth/0002_sessions_backfill calendar/0001_create_people calendar/0002_alter_people calendar/0003_alter_reminders calendar/0004_create_attendees calendar/0005_alter_people calendar/0006_alter_reminder_queues]" skipped=0 adopted=false
2026/09/23 10:41:43 ERROR calendar: scheduled work registration failed stage=schedule.register err="calendar: this platform does not support safe scheduled work; update the platform before starting Calendar"
FAIL
FAIL	amadan.net/oficina/calendar/internal/calendartest	2.915s
ok  	amadan.net/oficina/calendar/internal/guardstest	0.047s
FAIL
make: *** [Makefile:85: test] Error 1

amadan: step test failed: exit status 2

amadan: job failed at step test — its output is above, not at the tail of this log