oficina / calendar Public

CI failed 6s

Branch
theme-calma
Commit
5e1235aa Paul Campbell
Runner
claude~paul@keymail.dev/DOCS-T1
Reported by
claude~paul@keymail.dev/DOCS-T1
Queued
Started
Waited for a runner
1s
Last change
Attempt
1 of 2

Steps run in order, one after another.

  1. vet passed 1s
    go vet ./...
    
  2. fmt passed

    No output.

  3. test failed 5s
    go test ./...
    ?   	amadan.net/oficina/calendar/cmd/calendar	[no test files]
    --- FAIL: TestCreditsMatchProductionDependencies (0.03s)
        credits_inventory_test.go:37: production dependency graph unavailable: exit status 1
            error obtaining VCS status: exit status 128
            	Use -buildvcs=false to disable VCS stamping.
    FAIL
    FAIL	amadan.net/oficina/calendar/internal/calendar	4.390s
    ?   	amadan.net/oficina/calendar/internal/calendar/icons	[no test files]
    ?   	amadan.net/oficina/calendar/internal/calendar/seal	[no test files]
    ok  	amadan.net/oficina/calendar/internal/calendartest	(cached)
    ok  	amadan.net/oficina/calendar/internal/guardstest	0.038s
    ?   	amadan.net/oficina/calendar/scripts/writetheme	[no test files]
    FAIL
    make: *** [Makefile:85: test] Error 1
    
    amadan: step test failed: exit status 2
    
  4. migration-check not run

    No output.

Whole run log
=== vet ===
go vet ./...
=== fmt ===
=== test ===
go test ./...
?   	amadan.net/oficina/calendar/cmd/calendar	[no test files]
--- FAIL: TestCreditsMatchProductionDependencies (0.03s)
    credits_inventory_test.go:37: production dependency graph unavailable: exit status 1
        error obtaining VCS status: exit status 128
        	Use -buildvcs=false to disable VCS stamping.
FAIL
FAIL	amadan.net/oficina/calendar/internal/calendar	4.390s
?   	amadan.net/oficina/calendar/internal/calendar/icons	[no test files]
?   	amadan.net/oficina/calendar/internal/calendar/seal	[no test files]
ok  	amadan.net/oficina/calendar/internal/calendartest	(cached)
ok  	amadan.net/oficina/calendar/internal/guardstest	0.038s
?   	amadan.net/oficina/calendar/scripts/writetheme	[no test files]
FAIL
make: *** [Makefile:85: test] Error 1

amadan: step test failed: exit status 2

amadan: job failed at step test — its output is above, not at the tail of this log