CI failed 14s
- Branch
feat/home-consumer- Commit
465eb4efPaul Campbell
- Runner
claude~paul@keymail.dev/DOCS-T1- Reported by
claude~paul@keymail.dev/DOCS-T1- Queued
- Started
- Last change
- Attempt
- 1 of 2
Steps run in order, one after another.
-
vet passed 2s
go vet ./...
-
fmt passed
No output.
-
test failed 11s
go test ./... ? amadan.net/oficina/calendar/cmd/calendar [no test files] ok amadan.net/oficina/calendar/internal/calendar 6.213s ? amadan.net/oficina/calendar/internal/calendar/icons [no test files] ? amadan.net/oficina/calendar/internal/calendar/seal [no test files] --- FAIL: TestPublicBookingPostRegistersItsHoldAndMail (0.07s) schedule_delivery_test.go:83: public booking did not register scheduled work: got 2026-09-30 20:58:52 +0000 UTC, expected 2026-09-30 22:23:52 +0100 IST 2026/09/30 21:53:53 INFO migrate applied="[sessions/0001_init auth/0001_init auth/0002_sessions_backfill calendar/0001_create_people calendar/0002_alter_people calendar/0003_alter_reminders calendar/0004_create_attendees calendar/0005_alter_people calendar/0006_alter_reminder_queues]" skipped=0 adopted=false 2026/09/30 21:53:53 ERROR calendar: scheduled work registration failed stage=schedule.register err="calendar: this platform does not support safe scheduled work; update the platform before starting Calendar" FAIL FAIL amadan.net/oficina/calendar/internal/calendartest 7.238s ok amadan.net/oficina/calendar/internal/guardstest 0.159s ? amadan.net/oficina/calendar/scripts/writeestilo [no test files] FAIL make: *** [Makefile:85: test] Error 1 amadan: step test failed: exit status 2 -
migration-check not run
No output.
Whole run log
=== vet ===
go vet ./...
=== fmt ===
=== test ===
go test ./...
? amadan.net/oficina/calendar/cmd/calendar [no test files]
ok amadan.net/oficina/calendar/internal/calendar 6.213s
? amadan.net/oficina/calendar/internal/calendar/icons [no test files]
? amadan.net/oficina/calendar/internal/calendar/seal [no test files]
--- FAIL: TestPublicBookingPostRegistersItsHoldAndMail (0.07s)
schedule_delivery_test.go:83: public booking did not register scheduled work: got 2026-09-30 20:58:52 +0000 UTC, expected 2026-09-30 22:23:52 +0100 IST
2026/09/30 21:53:53 INFO migrate applied="[sessions/0001_init auth/0001_init auth/0002_sessions_backfill calendar/0001_create_people calendar/0002_alter_people calendar/0003_alter_reminders calendar/0004_create_attendees calendar/0005_alter_people calendar/0006_alter_reminder_queues]" skipped=0 adopted=false
2026/09/30 21:53:53 ERROR calendar: scheduled work registration failed stage=schedule.register err="calendar: this platform does not support safe scheduled work; update the platform before starting Calendar"
FAIL
FAIL amadan.net/oficina/calendar/internal/calendartest 7.238s
ok amadan.net/oficina/calendar/internal/guardstest 0.159s
? amadan.net/oficina/calendar/scripts/writeestilo [no test files]
FAIL
make: *** [Makefile:85: test] Error 1
amadan: step test failed: exit status 2
amadan: job failed at step test — its output is above, not at the tail of this log
Watching for changes…