CI failed 8s
- Branch
feat/r2-shared-chrome- Commit
16c5197aPaul Campbell
- Runner
claude~paul@keymail.dev/DOCS-T1- Reported by
claude~paul@keymail.dev/DOCS-T1- Queued
- Started
- Waited for a runner
- 4s
- Last change
- Attempt
- 1 of 2
Steps run in order, one after another.
-
vet passed 2s
go vet ./... go: downloading amadan.net/oficina/home/connect v0.0.0-20260923190447-01166fcfc0a9 go: downloading amadan.net/oficina/estilo.git v0.0.0-20260924071126-894afdcb71a9
-
fmt passed
No output.
-
test failed 6s
go test ./... ? amadan.net/oficina/calendar/cmd/calendar [no test files] --- FAIL: TestHomeRouterRetainsExistingCalendarIdentity (0.02s) home_router_test.go:148: redirect status 307: FAIL FAIL amadan.net/oficina/calendar/internal/calendar 4.504s ? amadan.net/oficina/calendar/internal/calendar/icons [no test files] ? amadan.net/oficina/calendar/internal/calendar/seal [no test files] --- FAIL: TestABookedEventsFormLocksItsTimeButSavesItsTitle (0.02s) booking_settings_test.go:150: reschedule: changed=false err=calendar: slot taken 2026/09/24 14:26:36 INFO migrate applied="[sessions/0001_init auth/0001_init auth/0002_sessions_backfill calendar/0001_create_people calendar/0002_alter_people calendar/0003_alter_reminders calendar/0004_create_attendees calendar/0005_alter_people calendar/0006_alter_reminder_queues]" skipped=0 adopted=false 2026/09/24 14:26:36 ERROR calendar: scheduled work registration failed stage=schedule.register err="calendar: this platform does not support safe scheduled work; update the platform before starting Calendar" FAIL FAIL amadan.net/oficina/calendar/internal/calendartest 1.979s --- FAIL: TestOurCSSDoesNotClaimAnotherPrefix (0.00s) guards_test.go:226: calendar.css defines a selector for another namespace: "[rst-" — this app's prefix is cal- FAIL FAIL amadan.net/oficina/calendar/internal/guardstest 0.036s FAIL make: *** [Makefile:85: test] Error 1 amadan: step test failed: exit status 2 -
migration-check not run
No output.
Whole run log
=== vet ===
go vet ./...
go: downloading amadan.net/oficina/home/connect v0.0.0-20260923190447-01166fcfc0a9
go: downloading amadan.net/oficina/estilo.git v0.0.0-20260924071126-894afdcb71a9
=== fmt ===
=== test ===
go test ./...
? amadan.net/oficina/calendar/cmd/calendar [no test files]
--- FAIL: TestHomeRouterRetainsExistingCalendarIdentity (0.02s)
home_router_test.go:148: redirect status 307:
FAIL
FAIL amadan.net/oficina/calendar/internal/calendar 4.504s
? amadan.net/oficina/calendar/internal/calendar/icons [no test files]
? amadan.net/oficina/calendar/internal/calendar/seal [no test files]
--- FAIL: TestABookedEventsFormLocksItsTimeButSavesItsTitle (0.02s)
booking_settings_test.go:150: reschedule: changed=false err=calendar: slot taken
2026/09/24 14:26:36 INFO migrate applied="[sessions/0001_init auth/0001_init auth/0002_sessions_backfill calendar/0001_create_people calendar/0002_alter_people calendar/0003_alter_reminders calendar/0004_create_attendees calendar/0005_alter_people calendar/0006_alter_reminder_queues]" skipped=0 adopted=false
2026/09/24 14:26:36 ERROR calendar: scheduled work registration failed stage=schedule.register err="calendar: this platform does not support safe scheduled work; update the platform before starting Calendar"
FAIL
FAIL amadan.net/oficina/calendar/internal/calendartest 1.979s
--- FAIL: TestOurCSSDoesNotClaimAnotherPrefix (0.00s)
guards_test.go:226: calendar.css defines a selector for another namespace: "[rst-" — this app's prefix is cal-
FAIL
FAIL amadan.net/oficina/calendar/internal/guardstest 0.036s
FAIL
make: *** [Makefile:85: test] Error 1
amadan: step test failed: exit status 2
amadan: job failed at step test — its output is above, not at the tail of this log
Watching for changes…