CI failed 7m 25s
- Branch
feat/claim-root-trusted-state-e- Commit
e336c737Paul Campbell
- Runner
ci-aws~paul@keymail.dev/ip-172-31-30-1- Reported by
ci-aws~paul@keymail.dev/ip-172-31-30-1- Queued
- Started
- Waited for a runner
- 3m 35s
- Last change
- Attempt
- 1 of 2
Steps run in order, one after another.
-
gate failed 7m 22s
go: downloading github.com/aws/aws-sdk-go-v2 v1.44.0 go: downloading github.com/aws/aws-sdk-go-v2/service/sns v1.43.0 go: downloading github.com/aws/aws-sdk-go-v2/config v1.32.6 go: downloading github.com/aws/aws-sdk-go-v2/service/ec2 v1.324.0 go: downloading github.com/aws/aws-sdk-go-v2/service/s3 v1.105.0 go: downloading github.com/benbjohnson/litestream v0.5.14 go: downloading modernc.org/sqlite v1.55.0 go: downloading github.com/aws/aws-sdk-go-v2/service/route53 v1.64.1 go: downloading github.com/superfly/ltx v0.5.1 go: downloading github.com/aws/aws-sdk-go-v2/service/acm v1.45.0 go: downloading github.com/aws/aws-sdk-go-v2/service/cloudwatch v1.68.0 go: downloading github.com/aws/aws-sdk-go-v2/service/iam v1.58.2 go: downloading github.com/aws/aws-sdk-go-v2/service/resourcegroupstaggingapi v1.37.0 go: downloading github.com/aws/aws-sdk-go-v2/service/sts v1.45.6 go: downloading github.com/aws/smithy-go v1.28.1 go: downloading golang.org/x/crypto v0.52.0 go: downloading golang.org/x/sys v0.46.0 go: downloading github.com/aws/aws-sdk-go-v2/credentials v1.19.6 go: downloading github.com/pion/logging v0.2.4 go: downloading github.com/pion/stun/v3 v3.0.1 go: downloading github.com/pion/turn/v4 v4.1.4 go: downloading github.com/aws/aws-sdk-go-v2/service/sesv2 v1.66.6 go: downloading github.com/oschwald/maxminddb-golang v1.13.1 go: downloading github.com/klauspost/compress v1.18.0 go: downloading golang.org/x/net v0.55.0 go: downloading github.com/aws/aws-sdk-go-v2/service/costexplorer v1.67.5 go: downloading github.com/pion/transport/v4 v4.0.1 go: downloading github.com/pion/randutil v0.1.0 go: downloading github.com/aws/aws-sdk-go-v2/feature/ec2/imds v1.18.16 go: downloading github.com/aws/aws-sdk-go-v2/internal/ini v1.8.4 go: downloading github.com/aws/aws-sdk-go-v2/service/signin v1.0.4 go: downloading github.com/aws/aws-sdk-go-v2/service/sso v1.30.8 go: downloading github.com/aws/aws-sdk-go-v2/service/ssooidc v1.35.12 go: downloading github.com/aws/aws-sdk-go-v2/internal/configsources v1.4.40 go: downloading github.com/aws/aws-sdk-go-v2/internal/v4a v1.4.38 go: downloading github.com/aws/aws-sdk-go-v2/service/internal/accept-encoding v1.13.19 go: downloading github.com/aws/aws-sdk-go-v2/service/internal/presigned-url v1.13.40 go: downloading github.com/pion/dtls/v3 v3.0.7 go: downloading github.com/pion/transport/v3 v3.0.8 go: downloading github.com/pierrec/lz4/v4 v4.1.22 go: downloading github.com/aws/aws-sdk-go-v2/internal/endpoints/v2 v2.7.40 go: downloading github.com/aws/aws-sdk-go-v2/aws/protocol/eventstream v1.7.14 go: downloading github.com/aws/aws-sdk-go-v2/service/internal/checksum v1.9.23 go: downloading github.com/aws/aws-sdk-go-v2/service/internal/s3shared v1.19.31 go: downloading github.com/prometheus/client_golang v1.17.0 go: downloading golang.org/x/sync v0.21.0 go: downloading github.com/lmittmann/tint v1.1.3 go: downloading github.com/mattn/go-isatty v0.0.20 go: downloading github.com/aws/aws-sdk-go-v2/feature/s3/manager v1.20.18 go: downloading google.golang.org/protobuf v1.36.10 go: downloading github.com/beorn7/perks v1.0.1 go: downloading github.com/cespare/xxhash/v2 v2.3.0 go: downloading github.com/prometheus/procfs v0.12.0 go: downloading github.com/prometheus/client_model v0.5.0 go: downloading github.com/prometheus/common v0.45.0 go: downloading github.com/wlynxg/anet v0.0.5 go: downloading github.com/matttproud/golang_protobuf_extensions/v2 v2.0.0 go: downloading golang.org/x/text v0.37.0 go: downloading modernc.org/libc v1.74.1 go: downloading modernc.org/memory v1.11.0 go: downloading github.com/google/uuid v1.6.0 go: downloading modernc.org/mathutil v1.7.1 go: downloading github.com/dustin/go-humanize v1.0.1 go: downloading github.com/remyoudompheng/bigfft v0.0.0-20230129092748-24d4a6f8daec cd launchctx && go vet ./... && go test ./... -count=1 ok amadan.net/carlos/platform.git/launchctx 0.011s ? amadan.net/carlos/platform.git/launchctx/controlname [no test files] ? amadan.net/carlos/platform.git/launchctx/wireid [no test files] go vet ./... gofmt -l .: clean go test ./... -count=1 -timeout 30m ok github.com/carlosframework/platform 285.729s ? github.com/carlosframework/platform/cmd/changelog [no test files] ok github.com/carlosframework/platform/cmd/console 2.864s ok github.com/carlosframework/platform/cmd/moveprobe 93.441s ok github.com/carlosframework/platform/cmd/zddprobe 0.706s ok github.com/carlosframework/platform/internal/activator 251.699s ok github.com/carlosframework/platform/internal/agentsock 0.016s ok github.com/carlosframework/platform/internal/alerting 0.003s ok github.com/carlosframework/platform/internal/analytics 0.019s ok github.com/carlosframework/platform/internal/appconfig 2.443s ok github.com/carlosframework/platform/internal/apperr 0.073s ok github.com/carlosframework/platform/internal/applog 0.124s ok github.com/carlosframework/platform/internal/awsinv 0.005s ok github.com/carlosframework/platform/internal/boxchoice 0.004s ok github.com/carlosframework/platform/internal/boxid 0.616s ? github.com/carlosframework/platform/internal/boxid/boxidtest [no test files] ? github.com/carlosframework/platform/internal/boxid/internal/signtest [no test files] ok github.com/carlosframework/platform/internal/boxvolumes 0.008s ok github.com/carlosframework/platform/internal/caps 0.013s ok github.com/carlosframework/platform/internal/certwarm 0.002s ok github.com/carlosframework/platform/internal/cgroup 0.703s ok github.com/carlosframework/platform/internal/changelog 0.306s ok github.com/carlosframework/platform/internal/clamd 0.054s ? github.com/carlosframework/platform/internal/cliflag [no test files] ok github.com/carlosframework/platform/internal/console 388.631s ? github.com/carlosframework/platform/internal/controlname [no test files] ? github.com/carlosframework/platform/internal/controlsock [no test files] ok github.com/carlosframework/platform/internal/dbdoor 5.737s ok github.com/carlosframework/platform/internal/dbdoor/dbdoortest 0.009s ok github.com/carlosframework/platform/internal/dbverify 0.004s ok github.com/carlosframework/platform/internal/dnsrec 0.002s ok github.com/carlosframework/platform/internal/docsite 0.005s ok github.com/carlosframework/platform/internal/domains 2.326s ok github.com/carlosframework/platform/internal/doorkey 0.006s ok github.com/carlosframework/platform/internal/economics 0.005s ok github.com/carlosframework/platform/internal/edge 27.193s ? github.com/carlosframework/platform/internal/edgeproof [no test files] ok github.com/carlosframework/platform/internal/edgesfile 0.008s ok github.com/carlosframework/platform/internal/fleetapi 0.131s ok github.com/carlosframework/platform/internal/gate 1.655s ok github.com/carlosframework/platform/internal/genselect 0.015s ok github.com/carlosframework/platform/internal/geo 0.018s ok github.com/carlosframework/platform/internal/geoip 0.029s ok github.com/carlosframework/platform/internal/historyreadback 0.151s ok github.com/carlosframework/platform/internal/host 146.373s ok github.com/carlosframework/platform/internal/hostactors 0.288s ok github.com/carlosframework/platform/internal/hostbox 2.403s ok github.com/carlosframework/platform/internal/hostclaim 0.482s ok github.com/carlosframework/platform/internal/hostevidence 0.016s --- FAIL: TestRenewalRequestStartAndIndependentExpiry (4.01s) controller_test.go:211: blocked PUT blocked watchdog panic.go:694: context deadline exceeded FAIL FAIL github.com/carlosframework/platform/internal/hostexec 9.705s ok github.com/carlosframework/platform/internal/hostfence 0.028s ok github.com/carlosframework/platform/internal/hostfiles 10.826s ok github.com/carlosframework/platform/internal/hostfloor 0.015s ok github.com/carlosframework/platform/internal/hostguard 0.981s ok github.com/carlosframework/platform/internal/hostops 1.545s ? github.com/carlosframework/platform/internal/hostops/fencerelease [no test files] ok github.com/carlosframework/platform/internal/hostops/internal/fencerelease 0.015s ok github.com/carlosframework/platform/internal/hostquarantine 0.015s ok github.com/carlosframework/platform/internal/hostrelocate 0.434s ok github.com/carlosframework/platform/internal/hostresolve 0.148s ok github.com/carlosframework/platform/internal/hostwrite 0.015s ok github.com/carlosframework/platform/internal/infraview 0.015s ok github.com/carlosframework/platform/internal/instancectl 5.227s ok github.com/carlosframework/platform/internal/instanceexec 2.729s ok github.com/carlosframework/platform/internal/instancefs 0.020s ok github.com/carlosframework/platform/internal/instancekey 0.017s ok github.com/carlosframework/platform/internal/instanceupdates 0.024s ok github.com/carlosframework/platform/internal/layout 1.512s ok github.com/carlosframework/platform/internal/lease 9.841s ok github.com/carlosframework/platform/internal/lease/leasetest 0.022s ok github.com/carlosframework/platform/internal/ledger 0.027s ok github.com/carlosframework/platform/internal/mail 0.181s ok github.com/carlosframework/platform/internal/maintenance 0.092s ok github.com/carlosframework/platform/internal/maintenanceexec 5.518s ok github.com/carlosframework/platform/internal/maintenanceguard 0.079s ok github.com/carlosframework/platform/internal/metrics 0.004s ok github.com/carlosframework/platform/internal/moves 21.616s ok github.com/carlosframework/platform/internal/moves/archive 0.754s ok github.com/carlosframework/platform/internal/objstore 0.185s ok github.com/carlosframework/platform/internal/ops 0.171s ok github.com/carlosframework/platform/internal/park 0.194s ok github.com/carlosframework/platform/internal/privatefile 0.003s ok github.com/carlosframework/platform/internal/provision 35.003s ok github.com/carlosframework/platform/internal/publicrelease 0.006s ? github.com/carlosframework/platform/internal/regionname [no test files] ok github.com/carlosframework/platform/internal/registry 5.701s ok github.com/carlosframework/platform/internal/relay 7.305s ok github.com/carlosframework/platform/internal/release 22.628s ok github.com/carlosframework/platform/internal/rollout 3.760s ok github.com/carlosframework/platform/internal/rolloutwords 0.003s ok github.com/carlosframework/platform/internal/rootaws 0.007s ok github.com/carlosframework/platform/internal/rootparticipation 0.008s ok github.com/carlosframework/platform/internal/rootstate 0.026s ok github.com/carlosframework/platform/internal/runs 0.573s ok github.com/carlosframework/platform/internal/s3compat 0.004s ok github.com/carlosframework/platform/internal/safefile 0.004s ok github.com/carlosframework/platform/internal/schedule 2.486s ok github.com/carlosframework/platform/internal/seeds 0.010s ok github.com/carlosframework/platform/internal/sim/hostlife 11.395s ok github.com/carlosframework/platform/internal/sim/litestreamfacts 4.218s ok github.com/carlosframework/platform/internal/status 0.040s ok github.com/carlosframework/platform/internal/steering 0.005s ok github.com/carlosframework/platform/internal/stopevidence 0.236s ok github.com/carlosframework/platform/internal/svcrole 0.002s ok github.com/carlosframework/platform/internal/telemetry 0.003s ok github.com/carlosframework/platform/internal/termfence 0.004s ok github.com/carlosframework/platform/internal/tunnelclient 0.004s ok github.com/carlosframework/platform/internal/unixdial 0.002s ok github.com/carlosframework/platform/internal/updatewords 0.004s ok github.com/carlosframework/platform/internal/usage 0.004s ok github.com/carlosframework/platform/internal/version 0.002s ok github.com/carlosframework/platform/internal/vet 1.561s FAIL make: *** [Makefile:18: test] Error 1 amadan: step gate failed: exit status 2 -
cross not run
No output.
-
minio-contract not run
No output.
Whole run log
=== gate ===
go: downloading github.com/aws/aws-sdk-go-v2 v1.44.0
go: downloading github.com/aws/aws-sdk-go-v2/service/sns v1.43.0
go: downloading github.com/aws/aws-sdk-go-v2/config v1.32.6
go: downloading github.com/aws/aws-sdk-go-v2/service/ec2 v1.324.0
go: downloading github.com/aws/aws-sdk-go-v2/service/s3 v1.105.0
go: downloading github.com/benbjohnson/litestream v0.5.14
go: downloading modernc.org/sqlite v1.55.0
go: downloading github.com/aws/aws-sdk-go-v2/service/route53 v1.64.1
go: downloading github.com/superfly/ltx v0.5.1
go: downloading github.com/aws/aws-sdk-go-v2/service/acm v1.45.0
go: downloading github.com/aws/aws-sdk-go-v2/service/cloudwatch v1.68.0
go: downloading github.com/aws/aws-sdk-go-v2/service/iam v1.58.2
go: downloading github.com/aws/aws-sdk-go-v2/service/resourcegroupstaggingapi v1.37.0
go: downloading github.com/aws/aws-sdk-go-v2/service/sts v1.45.6
go: downloading github.com/aws/smithy-go v1.28.1
go: downloading golang.org/x/crypto v0.52.0
go: downloading golang.org/x/sys v0.46.0
go: downloading github.com/aws/aws-sdk-go-v2/credentials v1.19.6
go: downloading github.com/pion/logging v0.2.4
go: downloading github.com/pion/stun/v3 v3.0.1
go: downloading github.com/pion/turn/v4 v4.1.4
go: downloading github.com/aws/aws-sdk-go-v2/service/sesv2 v1.66.6
go: downloading github.com/oschwald/maxminddb-golang v1.13.1
go: downloading github.com/klauspost/compress v1.18.0
go: downloading golang.org/x/net v0.55.0
go: downloading github.com/aws/aws-sdk-go-v2/service/costexplorer v1.67.5
go: downloading github.com/pion/transport/v4 v4.0.1
go: downloading github.com/pion/randutil v0.1.0
go: downloading github.com/aws/aws-sdk-go-v2/feature/ec2/imds v1.18.16
go: downloading github.com/aws/aws-sdk-go-v2/internal/ini v1.8.4
go: downloading github.com/aws/aws-sdk-go-v2/service/signin v1.0.4
go: downloading github.com/aws/aws-sdk-go-v2/service/sso v1.30.8
go: downloading github.com/aws/aws-sdk-go-v2/service/ssooidc v1.35.12
go: downloading github.com/aws/aws-sdk-go-v2/internal/configsources v1.4.40
go: downloading github.com/aws/aws-sdk-go-v2/internal/v4a v1.4.38
go: downloading github.com/aws/aws-sdk-go-v2/service/internal/accept-encoding v1.13.19
go: downloading github.com/aws/aws-sdk-go-v2/service/internal/presigned-url v1.13.40
go: downloading github.com/pion/dtls/v3 v3.0.7
go: downloading github.com/pion/transport/v3 v3.0.8
go: downloading github.com/pierrec/lz4/v4 v4.1.22
go: downloading github.com/aws/aws-sdk-go-v2/internal/endpoints/v2 v2.7.40
go: downloading github.com/aws/aws-sdk-go-v2/aws/protocol/eventstream v1.7.14
go: downloading github.com/aws/aws-sdk-go-v2/service/internal/checksum v1.9.23
go: downloading github.com/aws/aws-sdk-go-v2/service/internal/s3shared v1.19.31
go: downloading github.com/prometheus/client_golang v1.17.0
go: downloading golang.org/x/sync v0.21.0
go: downloading github.com/lmittmann/tint v1.1.3
go: downloading github.com/mattn/go-isatty v0.0.20
go: downloading github.com/aws/aws-sdk-go-v2/feature/s3/manager v1.20.18
go: downloading google.golang.org/protobuf v1.36.10
go: downloading github.com/beorn7/perks v1.0.1
go: downloading github.com/cespare/xxhash/v2 v2.3.0
go: downloading github.com/prometheus/procfs v0.12.0
go: downloading github.com/prometheus/client_model v0.5.0
go: downloading github.com/prometheus/common v0.45.0
go: downloading github.com/wlynxg/anet v0.0.5
go: downloading github.com/matttproud/golang_protobuf_extensions/v2 v2.0.0
go: downloading golang.org/x/text v0.37.0
go: downloading modernc.org/libc v1.74.1
go: downloading modernc.org/memory v1.11.0
go: downloading github.com/google/uuid v1.6.0
go: downloading modernc.org/mathutil v1.7.1
go: downloading github.com/dustin/go-humanize v1.0.1
go: downloading github.com/remyoudompheng/bigfft v0.0.0-20230129092748-24d4a6f8daec
cd launchctx && go vet ./... && go test ./... -count=1
ok amadan.net/carlos/platform.git/launchctx 0.011s
? amadan.net/carlos/platform.git/launchctx/controlname [no test files]
? amadan.net/carlos/platform.git/launchctx/wireid [no test files]
go vet ./...
gofmt -l .: clean
go test ./... -count=1 -timeout 30m
ok github.com/carlosframework/platform 285.729s
? github.com/carlosframework/platform/cmd/changelog [no test files]
ok github.com/carlosframework/platform/cmd/console 2.864s
ok github.com/carlosframework/platform/cmd/moveprobe 93.441s
ok github.com/carlosframework/platform/cmd/zddprobe 0.706s
ok github.com/carlosframework/platform/internal/activator 251.699s
ok github.com/carlosframework/platform/internal/agentsock 0.016s
ok github.com/carlosframework/platform/internal/alerting 0.003s
ok github.com/carlosframework/platform/internal/analytics 0.019s
ok github.com/carlosframework/platform/internal/appconfig 2.443s
ok github.com/carlosframework/platform/internal/apperr 0.073s
ok github.com/carlosframework/platform/internal/applog 0.124s
ok github.com/carlosframework/platform/internal/awsinv 0.005s
ok github.com/carlosframework/platform/internal/boxchoice 0.004s
ok github.com/carlosframework/platform/internal/boxid 0.616s
? github.com/carlosframework/platform/internal/boxid/boxidtest [no test files]
? github.com/carlosframework/platform/internal/boxid/internal/signtest [no test files]
ok github.com/carlosframework/platform/internal/boxvolumes 0.008s
ok github.com/carlosframework/platform/internal/caps 0.013s
ok github.com/carlosframework/platform/internal/certwarm 0.002s
ok github.com/carlosframework/platform/internal/cgroup 0.703s
ok github.com/carlosframework/platform/internal/changelog 0.306s
ok github.com/carlosframework/platform/internal/clamd 0.054s
? github.com/carlosframework/platform/internal/cliflag [no test files]
ok github.com/carlosframework/platform/internal/console 388.631s
? github.com/carlosframework/platform/internal/controlname [no test files]
? github.com/carlosframework/platform/internal/controlsock [no test files]
ok github.com/carlosframework/platform/internal/dbdoor 5.737s
ok github.com/carlosframework/platform/internal/dbdoor/dbdoortest 0.009s
ok github.com/carlosframework/platform/internal/dbverify 0.004s
ok github.com/carlosframework/platform/internal/dnsrec 0.002s
ok github.com/carlosframework/platform/internal/docsite 0.005s
ok github.com/carlosframework/platform/internal/domains 2.326s
ok github.com/carlosframework/platform/internal/doorkey 0.006s
ok github.com/carlosframework/platform/internal/economics 0.005s
ok github.com/carlosframework/platform/internal/edge 27.193s
? github.com/carlosframework/platform/internal/edgeproof [no test files]
ok github.com/carlosframework/platform/internal/edgesfile 0.008s
ok github.com/carlosframework/platform/internal/fleetapi 0.131s
ok github.com/carlosframework/platform/internal/gate 1.655s
ok github.com/carlosframework/platform/internal/genselect 0.015s
ok github.com/carlosframework/platform/internal/geo 0.018s
ok github.com/carlosframework/platform/internal/geoip 0.029s
ok github.com/carlosframework/platform/internal/historyreadback 0.151s
ok github.com/carlosframework/platform/internal/host 146.373s
ok github.com/carlosframework/platform/internal/hostactors 0.288s
ok github.com/carlosframework/platform/internal/hostbox 2.403s
ok github.com/carlosframework/platform/internal/hostclaim 0.482s
ok github.com/carlosframework/platform/internal/hostevidence 0.016s
--- FAIL: TestRenewalRequestStartAndIndependentExpiry (4.01s)
controller_test.go:211: blocked PUT blocked watchdog
panic.go:694: context deadline exceeded
FAIL
FAIL github.com/carlosframework/platform/internal/hostexec 9.705s
ok github.com/carlosframework/platform/internal/hostfence 0.028s
ok github.com/carlosframework/platform/internal/hostfiles 10.826s
ok github.com/carlosframework/platform/internal/hostfloor 0.015s
ok github.com/carlosframework/platform/internal/hostguard 0.981s
ok github.com/carlosframework/platform/internal/hostops 1.545s
? github.com/carlosframework/platform/internal/hostops/fencerelease [no test files]
ok github.com/carlosframework/platform/internal/hostops/internal/fencerelease 0.015s
ok github.com/carlosframework/platform/internal/hostquarantine 0.015s
ok github.com/carlosframework/platform/internal/hostrelocate 0.434s
ok github.com/carlosframework/platform/internal/hostresolve 0.148s
ok github.com/carlosframework/platform/internal/hostwrite 0.015s
ok github.com/carlosframework/platform/internal/infraview 0.015s
ok github.com/carlosframework/platform/internal/instancectl 5.227s
ok github.com/carlosframework/platform/internal/instanceexec 2.729s
ok github.com/carlosframework/platform/internal/instancefs 0.020s
ok github.com/carlosframework/platform/internal/instancekey 0.017s
ok github.com/carlosframework/platform/internal/instanceupdates 0.024s
ok github.com/carlosframework/platform/internal/layout 1.512s
ok github.com/carlosframework/platform/internal/lease 9.841s
ok github.com/carlosframework/platform/internal/lease/leasetest 0.022s
ok github.com/carlosframework/platform/internal/ledger 0.027s
ok github.com/carlosframework/platform/internal/mail 0.181s
ok github.com/carlosframework/platform/internal/maintenance 0.092s
ok github.com/carlosframework/platform/internal/maintenanceexec 5.518s
ok github.com/carlosframework/platform/internal/maintenanceguard 0.079s
ok github.com/carlosframework/platform/internal/metrics 0.004s
ok github.com/carlosframework/platform/internal/moves 21.616s
ok github.com/carlosframework/platform/internal/moves/archive 0.754s
ok github.com/carlosframework/platform/internal/objstore 0.185s
ok github.com/carlosframework/platform/internal/ops 0.171s
ok github.com/carlosframework/platform/internal/park 0.194s
ok github.com/carlosframework/platform/internal/privatefile 0.003s
ok github.com/carlosframework/platform/internal/provision 35.003s
ok github.com/carlosframework/platform/internal/publicrelease 0.006s
? github.com/carlosframework/platform/internal/regionname [no test files]
ok github.com/carlosframework/platform/internal/registry 5.701s
ok github.com/carlosframework/platform/internal/relay 7.305s
ok github.com/carlosframework/platform/internal/release 22.628s
ok github.com/carlosframework/platform/internal/rollout 3.760s
ok github.com/carlosframework/platform/internal/rolloutwords 0.003s
ok github.com/carlosframework/platform/internal/rootaws 0.007s
ok github.com/carlosframework/platform/internal/rootparticipation 0.008s
ok github.com/carlosframework/platform/internal/rootstate 0.026s
ok github.com/carlosframework/platform/internal/runs 0.573s
ok github.com/carlosframework/platform/internal/s3compat 0.004s
ok github.com/carlosframework/platform/internal/safefile 0.004s
ok github.com/carlosframework/platform/internal/schedule 2.486s
ok github.com/carlosframework/platform/internal/seeds 0.010s
ok github.com/carlosframework/platform/internal/sim/hostlife 11.395s
ok github.com/carlosframework/platform/internal/sim/litestreamfacts 4.218s
ok github.com/carlosframework/platform/internal/status 0.040s
ok github.com/carlosframework/platform/internal/steering 0.005s
ok github.com/carlosframework/platform/internal/stopevidence 0.236s
ok github.com/carlosframework/platform/internal/svcrole 0.002s
ok github.com/carlosframework/platform/internal/telemetry 0.003s
ok github.com/carlosframework/platform/internal/termfence 0.004s
ok github.com/carlosframework/platform/internal/tunnelclient 0.004s
ok github.com/carlosframework/platform/internal/unixdial 0.002s
ok github.com/carlosframework/platform/internal/updatewords 0.004s
ok github.com/carlosframework/platform/internal/usage 0.004s
ok github.com/carlosframework/platform/internal/version 0.002s
ok github.com/carlosframework/platform/internal/vet 1.561s
FAIL
make: *** [Makefile:18: test] Error 1
amadan: step gate failed: exit status 2
amadan: job failed at step gate — its output is above, not at the tail of this log
Watching for changes…