CI failed 4m 13s
- Branch
design-self-serve-offline-moves- Commit
c592a6bbclaude
- Runner
ci-aws~paul@keymail.dev/ip-172-31-21-92- Reported by
ci-aws~paul@keymail.dev/ip-172-31-21-92- Queued
- Started
- Waited for a runner
- 47s
- Last change
- Attempt
- 1 of 2
Steps run in order, one after another.
-
gate failed 4m 8s
.amadan/test-gate.sh go: downloading github.com/aws/aws-sdk-go-v2/service/cloudwatch v1.68.0 go: downloading github.com/aws/aws-sdk-go-v2 v1.44.0 go: downloading github.com/aws/aws-sdk-go-v2/service/costexplorer v1.67.5 go: downloading github.com/aws/aws-sdk-go-v2/service/s3 v1.105.0 go: downloading github.com/aws/smithy-go v1.28.1 go: downloading github.com/superfly/ltx v0.5.1 go: downloading golang.org/x/net v0.56.0 go: downloading modernc.org/sqlite v1.55.0 go: downloading github.com/aws/aws-sdk-go-v2/config v1.32.6 go: downloading github.com/aws/aws-sdk-go-v2/service/sns v1.43.0 go: downloading golang.org/x/crypto v0.53.0 go: downloading github.com/benbjohnson/litestream v0.5.14 go: downloading github.com/aws/aws-sdk-go-v2/service/route53 v1.64.1 go: downloading github.com/oschwald/maxminddb-golang v1.13.1 go: downloading github.com/aws/aws-sdk-go-v2/service/acm v1.45.0 go: downloading github.com/aws/aws-sdk-go-v2/service/ec2 v1.324.0 go: downloading github.com/aws/aws-sdk-go-v2/service/iam v1.58.2 go: downloading github.com/aws/aws-sdk-go-v2/service/resourcegroupstaggingapi v1.37.0 go: downloading github.com/aws/aws-sdk-go-v2/service/sts v1.45.6 go: downloading github.com/aws/aws-sdk-go-v2/service/autoscaling v1.74.0 go: downloading golang.org/x/sys v0.46.0 go: downloading github.com/pion/logging v0.2.4 go: downloading github.com/pion/stun/v3 v3.0.1 go: downloading github.com/benbjohnson/litestream v0.5.14 go: downloading github.com/aws/aws-sdk-go-v2/service/ec2 v1.324.0 go: downloading modernc.org/sqlite v1.55.0 go: downloading github.com/aws/aws-sdk-go-v2/credentials v1.19.6 go: downloading github.com/aws/aws-sdk-go-v2/service/ssm v1.74.0 go: downloading github.com/aws/aws-sdk-go-v2/service/autoscaling v1.74.0 go: downloading github.com/pion/turn/v4 v4.1.4 go: downloading github.com/pion/turn/v4 v4.1.4 go: downloading github.com/klauspost/compress v1.18.0 go: downloading github.com/pierrec/lz4/v4 v4.1.22 go: downloading github.com/pion/dtls/v3 v3.0.7 go: downloading github.com/pion/transport/v3 v3.0.8 go: downloading github.com/pion/randutil v0.1.0 go: downloading github.com/pion/transport/v4 v4.0.1 go: downloading github.com/pierrec/lz4/v4 v4.1.22 go: downloading github.com/pion/dtls/v3 v3.0.7 go: downloading github.com/pion/transport/v3 v3.0.8 go: downloading github.com/aws/aws-sdk-go-v2/feature/ec2/imds v1.18.16 go: downloading github.com/aws/aws-sdk-go-v2/internal/ini v1.8.4 go: downloading github.com/aws/aws-sdk-go-v2/service/signin v1.0.4 go: downloading github.com/aws/aws-sdk-go-v2/service/sso v1.30.8 go: downloading github.com/aws/aws-sdk-go-v2/service/ssooidc v1.35.12 go: downloading github.com/aws/aws-sdk-go-v2/internal/configsources v1.4.40 go: downloading github.com/aws/aws-sdk-go-v2/internal/v4a v1.4.38 go: downloading github.com/aws/aws-sdk-go-v2/internal/v4a v1.4.38 go: downloading github.com/aws/aws-sdk-go-v2/service/internal/accept-encoding v1.13.19 go: downloading github.com/aws/aws-sdk-go-v2/service/internal/presigned-url v1.13.40 go: downloading github.com/prometheus/client_golang v1.17.0 go: downloading github.com/aws/aws-sdk-go-v2/feature/s3/manager v1.20.18 go: downloading github.com/aws/aws-sdk-go-v2/internal/endpoints/v2 v2.7.40 go: downloading github.com/aws/aws-sdk-go-v2/service/internal/checksum v1.9.23 go: downloading github.com/aws/aws-sdk-go-v2/aws/protocol/eventstream v1.7.14 go: downloading github.com/aws/aws-sdk-go-v2/service/internal/s3shared v1.19.31 go: downloading github.com/wlynxg/anet v0.0.5 go: downloading github.com/lmittmann/tint v1.1.3 go: downloading github.com/mattn/go-isatty v0.0.20 go: downloading github.com/prometheus/client_golang v1.17.0 go: downloading github.com/aws/aws-sdk-go-v2/feature/s3/manager v1.20.18 go: downloading github.com/aws/aws-sdk-go-v2/internal/endpoints/v2 v2.7.40 go: downloading github.com/wlynxg/anet v0.0.5 go: downloading github.com/beorn7/perks v1.0.1 go: downloading github.com/prometheus/common v0.45.0 go: downloading github.com/prometheus/procfs v0.12.0 go: downloading google.golang.org/protobuf v1.36.10 go: downloading github.com/prometheus/client_model v0.5.0 go: downloading github.com/cespare/xxhash/v2 v2.3.0 go: downloading github.com/prometheus/common v0.45.0 go: downloading google.golang.org/protobuf v1.36.10 go: downloading github.com/prometheus/procfs v0.12.0 go: downloading golang.org/x/text v0.38.0 go: downloading golang.org/x/text v0.38.0 go: downloading modernc.org/libc v1.74.1 go: downloading modernc.org/libc v1.74.1 go: downloading modernc.org/memory v1.11.0 go: downloading github.com/dustin/go-humanize v1.0.1 go: downloading modernc.org/mathutil v1.7.1 go: downloading github.com/google/uuid v1.6.0 go: downloading modernc.org/memory v1.11.0 go: downloading github.com/dustin/go-humanize v1.0.1 go: downloading github.com/google/uuid v1.6.0 go: downloading modernc.org/mathutil v1.7.1 go: downloading github.com/remyoudompheng/bigfft v0.0.0-20230129092748-24d4a6f8daec go: downloading github.com/remyoudompheng/bigfft v0.0.0-20230129092748-24d4a6f8daec === launchctx (3 s) ok amadan.net/carlos/platform.git/launchctx 0.011s ? amadan.net/carlos/platform.git/launchctx/controlname [no test files] ? amadan.net/carlos/platform.git/launchctx/wireid [no test files] === vet (75 s) go: downloading github.com/aws/aws-sdk-go-v2/service/ec2 v1.324.0 go: downloading github.com/aws/aws-sdk-go-v2/service/autoscaling v1.74.0 go: downloading modernc.org/sqlite v1.55.0 go: downloading github.com/benbjohnson/litestream v0.5.14 go: downloading github.com/aws/aws-sdk-go-v2/service/sesv2 v1.66.6 go: downloading github.com/aws/aws-sdk-go-v2/service/ssm v1.74.0 go: downloading github.com/klauspost/compress v1.18.0 go: downloading golang.org/x/tools v0.47.0 go: downloading github.com/pierrec/lz4/v4 v4.1.22 go: downloading github.com/prometheus/client_golang v1.17.0 go: downloading golang.org/x/sync v0.21.0 go: downloading github.com/aws/aws-sdk-go-v2/feature/s3/manager v1.20.18 go: downloading github.com/aws/aws-sdk-go-v2/service/internal/checksum v1.9.23 go: downloading github.com/aws/aws-sdk-go-v2/service/internal/s3shared v1.19.31 go: downloading github.com/wlynxg/anet v0.0.5 go: downloading github.com/aws/aws-sdk-go-v2/aws/protocol/eventstream v1.7.14 go: downloading github.com/lmittmann/tint v1.1.3 go: downloading github.com/mattn/go-isatty v0.0.20 go: downloading github.com/aws/aws-sdk-go-v2/internal/endpoints/v2 v2.7.40 go: downloading github.com/prometheus/common v0.45.0 go: downloading github.com/cespare/xxhash/v2 v2.3.0 go: downloading github.com/prometheus/procfs v0.12.0 go: downloading google.golang.org/protobuf v1.36.10 go: downloading github.com/beorn7/perks v1.0.1 go: downloading github.com/prometheus/client_model v0.5.0 go: downloading github.com/matttproud/golang_protobuf_extensions/v2 v2.0.0 go: downloading golang.org/x/text v0.38.0 go: downloading modernc.org/libc v1.74.1 go: downloading golang.org/x/mod v0.37.0 go: downloading github.com/google/uuid v1.6.0 go: downloading modernc.org/mathutil v1.7.1 go: downloading github.com/dustin/go-humanize v1.0.1 go: downloading modernc.org/memory v1.11.0 go: downloading github.com/remyoudompheng/bigfft v0.0.0-20230129092748-24d4a6f8daec === gofmt (0 s) gofmt -l .: clean === rest (226 s) ? github.com/carlosframework/platform/cmd/changelog [no test files] ok github.com/carlosframework/platform/cmd/console 3.325s ok github.com/carlosframework/platform/cmd/moveprobe 11.754s ok github.com/carlosframework/platform/cmd/zddprobe 0.707s ok github.com/carlosframework/platform/internal/activator 63.126s ok github.com/carlosframework/platform/internal/agentsock 0.046s ok github.com/carlosframework/platform/internal/alerting 0.007s ok github.com/carlosframework/platform/internal/analytics 0.042s ok github.com/carlosframework/platform/internal/appconfig 2.764s ok github.com/carlosframework/platform/internal/apperr 0.121s ok github.com/carlosframework/platform/internal/applog 0.202s ok github.com/carlosframework/platform/internal/awsinv 0.008s ok github.com/carlosframework/platform/internal/boxchoice 0.007s ok github.com/carlosframework/platform/internal/boxid 0.594s ? github.com/carlosframework/platform/internal/boxid/boxidtest [no test files] ? github.com/carlosframework/platform/internal/boxid/internal/signtest [no test files] ok github.com/carlosframework/platform/internal/boxvolumes 0.009s ok github.com/carlosframework/platform/internal/caps 0.020s ok github.com/carlosframework/platform/internal/certwarm 0.005s ok github.com/carlosframework/platform/internal/cgroup 0.767s ok github.com/carlosframework/platform/internal/changelog 0.417s ok github.com/carlosframework/platform/internal/claimactivation 1.047s ok github.com/carlosframework/platform/internal/clamd 0.061s ? github.com/carlosframework/platform/internal/cliflag [no test files] ? github.com/carlosframework/platform/internal/controlname [no test files] ? github.com/carlosframework/platform/internal/controlsock [no test files] ok github.com/carlosframework/platform/internal/dbdoor 6.436s ok github.com/carlosframework/platform/internal/dbdoor/dbdoortest 0.011s ok github.com/carlosframework/platform/internal/dbverify 0.005s ok github.com/carlosframework/platform/internal/dnsrec 0.005s ok github.com/carlosframework/platform/internal/docsite 0.019s ok github.com/carlosframework/platform/internal/domains 2.719s ok github.com/carlosframework/platform/internal/doorkey 0.011s ok github.com/carlosframework/platform/internal/economics 0.006s ok github.com/carlosframework/platform/internal/edge 50.564s ? github.com/carlosframework/platform/internal/edgeproof [no test files] ok github.com/carlosframework/platform/internal/edgesfile 0.009s ok github.com/carlosframework/platform/internal/fleetapi 0.153s ok github.com/carlosframework/platform/internal/gate 1.678s ok github.com/carlosframework/platform/internal/genselect 0.020s ok github.com/carlosframework/platform/internal/geo 0.035s ok github.com/carlosframework/platform/internal/geoip 0.035s ok github.com/carlosframework/platform/internal/historyreadback 0.187s ok github.com/carlosframework/platform/internal/host 161.651s ok github.com/carlosframework/platform/internal/hostactors 7.872s ok github.com/carlosframework/platform/internal/hostactors/awsmembership 0.019s ok github.com/carlosframework/platform/internal/hostbox 4.416s ok github.com/carlosframework/platform/internal/hostclaim 1.374s ok github.com/carlosframework/platform/internal/hostenv 0.006s ok github.com/carlosframework/platform/internal/hostevidence 0.021s ok github.com/carlosframework/platform/internal/hostexec 7.173s ok github.com/carlosframework/platform/internal/hostfence 0.139s ok github.com/carlosframework/platform/internal/hostfiles 10.904s ok github.com/carlosframework/platform/internal/hostfloor 0.036s ok github.com/carlosframework/platform/internal/hostguard 1.200s ok github.com/carlosframework/platform/internal/hostops 3.035s ? github.com/carlosframework/platform/internal/hostops/fencerelease [no test files] ok github.com/carlosframework/platform/internal/hostops/internal/fencerelease 0.006s ok github.com/carlosframework/platform/internal/hostquarantine 0.003s ok github.com/carlosframework/platform/internal/hostrelocate 1.107s ok github.com/carlosframework/platform/internal/hostresolve 0.452s ok github.com/carlosframework/platform/internal/hostwrite 0.017s ok github.com/carlosframework/platform/internal/infraview 0.018s ok github.com/carlosframework/platform/internal/instancectl 5.332s ok github.com/carlosframework/platform/internal/instanceexec 3.076s ok github.com/carlosframework/platform/internal/instancefs 0.029s ok github.com/carlosframework/platform/internal/instancekey 0.017s ok github.com/carlosframework/platform/internal/instanceupdates 0.016s ok github.com/carlosframework/platform/internal/layout 2.381s ok github.com/carlosframework/platform/internal/lbhealth 0.019s ok github.com/carlosframework/platform/internal/lease 10.181s ok github.com/carlosframework/platform/internal/lease/leasetest 0.921s ok github.com/carlosframework/platform/internal/ledger 0.047s ok github.com/carlosframework/platform/internal/mail 0.450s ok github.com/carlosframework/platform/internal/maintenance 0.116s ok github.com/carlosframework/platform/internal/maintenanceexec 5.766s ok github.com/carlosframework/platform/internal/maintenanceguard 0.259s ok github.com/carlosframework/platform/internal/metrics 0.027s ok github.com/carlosframework/platform/internal/moves 36.780s ok github.com/carlosframework/platform/internal/moves/archive 1.570s ok github.com/carlosframework/platform/internal/objstore 0.461s ok github.com/carlosframework/platform/internal/ops 0.276s ok github.com/carlosframework/platform/internal/park 0.408s ok github.com/carlosframework/platform/internal/plans 0.024s ok github.com/carlosframework/platform/internal/privatefile 0.007s ok github.com/carlosframework/platform/internal/provision 73.842s ok github.com/carlosframework/platform/internal/publicrelease 0.009s ? github.com/carlosframework/platform/internal/regionname [no test files] ok github.com/carlosframework/platform/internal/registry 6.569s ok github.com/carlosframework/platform/internal/relay 7.232s ok github.com/carlosframework/platform/internal/release 32.816s --- FAIL: TestAMoveOntoTheInstalledGoodBuildWaitsForASignedRollback (5.03s) --- FAIL: TestAMoveOntoTheInstalledGoodBuildWaitsForASignedRollback/socket_instance (5.02s) holdran_test.go:796: timed out waiting for the move onto v1 FAIL FAIL github.com/carlosframework/platform/internal/rollout 8.667s ok github.com/carlosframework/platform/internal/rolloutwords 0.003s ok github.com/carlosframework/platform/internal/rootaws 0.012s ok github.com/carlosframework/platform/internal/rootparticipation 0.075s ok github.com/carlosframework/platform/internal/rootstate 0.059s ok github.com/carlosframework/platform/internal/runs 0.654s ok github.com/carlosframework/platform/internal/s3compat 0.005s ok github.com/carlosframework/platform/internal/safefile 0.007s ok github.com/carlosframework/platform/internal/schedule 3.094s ok github.com/carlosframework/platform/internal/seeds 0.028s ok github.com/carlosframework/platform/internal/sim/hostlife 13.507s ok github.com/carlosframework/platform/internal/sim/litestreamfacts 3.935s ok github.com/carlosframework/platform/internal/status 0.132s ok github.com/carlosframework/platform/internal/steering 0.011s ok github.com/carlosframework/platform/internal/stopevidence 0.384s ok github.com/carlosframework/platform/internal/svcrole 0.003s ok github.com/carlosframework/platform/internal/telemetry 0.006s ok github.com/carlosframework/platform/internal/termfence 0.005s ok github.com/carlosframework/platform/internal/tunnelclient 0.006s ok github.com/carlosframework/platform/internal/unixdial 0.005s ok github.com/carlosframework/platform/internal/updatewords 0.006s ok github.com/carlosframework/platform/internal/usage 0.007s ok github.com/carlosframework/platform/internal/version 0.007s ok github.com/carlosframework/platform/internal/vet 1.937s FAIL === internal_console@0 (92 s) ok github.com/carlosframework/platform/internal/console 90.346s === internal_console@1 (53 s) ok github.com/carlosframework/platform/internal/console 51.068s === internal_console@2 (54 s) ok github.com/carlosframework/platform/internal/console 51.983s === internal_console@3 (46 s) ok github.com/carlosframework/platform/internal/console 44.724s === internal_console@4 (52 s) ok github.com/carlosframework/platform/internal/console 50.953s === internal_console@5 (47 s) ok github.com/carlosframework/platform/internal/console 45.466s === internal_console@6 (50 s) ok github.com/carlosframework/platform/internal/console 48.881s === internal_console@7 (60 s) ok github.com/carlosframework/platform/internal/console 58.389s === root@0 (49 s) ok github.com/carlosframework/platform 47.152s === root@1 (56 s) ok github.com/carlosframework/platform 54.497s === root@2 (53 s) ok github.com/carlosframework/platform 51.251s FAILED: rest make: *** [Makefile:19: test] Error 1 amadan: step gate failed: exit status 2 -
cross not run
No output.
-
minio-contract not run
No output.
Whole run log
=== gate ===
.amadan/test-gate.sh
go: downloading github.com/aws/aws-sdk-go-v2/service/cloudwatch v1.68.0
go: downloading github.com/aws/aws-sdk-go-v2 v1.44.0
go: downloading github.com/aws/aws-sdk-go-v2/service/costexplorer v1.67.5
go: downloading github.com/aws/aws-sdk-go-v2/service/s3 v1.105.0
go: downloading github.com/aws/smithy-go v1.28.1
go: downloading github.com/superfly/ltx v0.5.1
go: downloading golang.org/x/net v0.56.0
go: downloading modernc.org/sqlite v1.55.0
go: downloading github.com/aws/aws-sdk-go-v2/config v1.32.6
go: downloading github.com/aws/aws-sdk-go-v2/service/sns v1.43.0
go: downloading golang.org/x/crypto v0.53.0
go: downloading github.com/benbjohnson/litestream v0.5.14
go: downloading github.com/aws/aws-sdk-go-v2/service/route53 v1.64.1
go: downloading github.com/oschwald/maxminddb-golang v1.13.1
go: downloading github.com/aws/aws-sdk-go-v2/service/acm v1.45.0
go: downloading github.com/aws/aws-sdk-go-v2/service/ec2 v1.324.0
go: downloading github.com/aws/aws-sdk-go-v2/service/iam v1.58.2
go: downloading github.com/aws/aws-sdk-go-v2/service/resourcegroupstaggingapi v1.37.0
go: downloading github.com/aws/aws-sdk-go-v2/service/sts v1.45.6
go: downloading github.com/aws/aws-sdk-go-v2/service/autoscaling v1.74.0
go: downloading golang.org/x/sys v0.46.0
go: downloading github.com/pion/logging v0.2.4
go: downloading github.com/pion/stun/v3 v3.0.1
go: downloading github.com/benbjohnson/litestream v0.5.14
go: downloading github.com/aws/aws-sdk-go-v2/service/ec2 v1.324.0
go: downloading modernc.org/sqlite v1.55.0
go: downloading github.com/aws/aws-sdk-go-v2/credentials v1.19.6
go: downloading github.com/aws/aws-sdk-go-v2/service/ssm v1.74.0
go: downloading github.com/aws/aws-sdk-go-v2/service/autoscaling v1.74.0
go: downloading github.com/pion/turn/v4 v4.1.4
go: downloading github.com/pion/turn/v4 v4.1.4
go: downloading github.com/klauspost/compress v1.18.0
go: downloading github.com/pierrec/lz4/v4 v4.1.22
go: downloading github.com/pion/dtls/v3 v3.0.7
go: downloading github.com/pion/transport/v3 v3.0.8
go: downloading github.com/pion/randutil v0.1.0
go: downloading github.com/pion/transport/v4 v4.0.1
go: downloading github.com/pierrec/lz4/v4 v4.1.22
go: downloading github.com/pion/dtls/v3 v3.0.7
go: downloading github.com/pion/transport/v3 v3.0.8
go: downloading github.com/aws/aws-sdk-go-v2/feature/ec2/imds v1.18.16
go: downloading github.com/aws/aws-sdk-go-v2/internal/ini v1.8.4
go: downloading github.com/aws/aws-sdk-go-v2/service/signin v1.0.4
go: downloading github.com/aws/aws-sdk-go-v2/service/sso v1.30.8
go: downloading github.com/aws/aws-sdk-go-v2/service/ssooidc v1.35.12
go: downloading github.com/aws/aws-sdk-go-v2/internal/configsources v1.4.40
go: downloading github.com/aws/aws-sdk-go-v2/internal/v4a v1.4.38
go: downloading github.com/aws/aws-sdk-go-v2/internal/v4a v1.4.38
go: downloading github.com/aws/aws-sdk-go-v2/service/internal/accept-encoding v1.13.19
go: downloading github.com/aws/aws-sdk-go-v2/service/internal/presigned-url v1.13.40
go: downloading github.com/prometheus/client_golang v1.17.0
go: downloading github.com/aws/aws-sdk-go-v2/feature/s3/manager v1.20.18
go: downloading github.com/aws/aws-sdk-go-v2/internal/endpoints/v2 v2.7.40
go: downloading github.com/aws/aws-sdk-go-v2/service/internal/checksum v1.9.23
go: downloading github.com/aws/aws-sdk-go-v2/aws/protocol/eventstream v1.7.14
go: downloading github.com/aws/aws-sdk-go-v2/service/internal/s3shared v1.19.31
go: downloading github.com/wlynxg/anet v0.0.5
go: downloading github.com/lmittmann/tint v1.1.3
go: downloading github.com/mattn/go-isatty v0.0.20
go: downloading github.com/prometheus/client_golang v1.17.0
go: downloading github.com/aws/aws-sdk-go-v2/feature/s3/manager v1.20.18
go: downloading github.com/aws/aws-sdk-go-v2/internal/endpoints/v2 v2.7.40
go: downloading github.com/wlynxg/anet v0.0.5
go: downloading github.com/beorn7/perks v1.0.1
go: downloading github.com/prometheus/common v0.45.0
go: downloading github.com/prometheus/procfs v0.12.0
go: downloading google.golang.org/protobuf v1.36.10
go: downloading github.com/prometheus/client_model v0.5.0
go: downloading github.com/cespare/xxhash/v2 v2.3.0
go: downloading github.com/prometheus/common v0.45.0
go: downloading google.golang.org/protobuf v1.36.10
go: downloading github.com/prometheus/procfs v0.12.0
go: downloading golang.org/x/text v0.38.0
go: downloading golang.org/x/text v0.38.0
go: downloading modernc.org/libc v1.74.1
go: downloading modernc.org/libc v1.74.1
go: downloading modernc.org/memory v1.11.0
go: downloading github.com/dustin/go-humanize v1.0.1
go: downloading modernc.org/mathutil v1.7.1
go: downloading github.com/google/uuid v1.6.0
go: downloading modernc.org/memory v1.11.0
go: downloading github.com/dustin/go-humanize v1.0.1
go: downloading github.com/google/uuid v1.6.0
go: downloading modernc.org/mathutil v1.7.1
go: downloading github.com/remyoudompheng/bigfft v0.0.0-20230129092748-24d4a6f8daec
go: downloading github.com/remyoudompheng/bigfft v0.0.0-20230129092748-24d4a6f8daec
=== launchctx (3 s)
ok amadan.net/carlos/platform.git/launchctx 0.011s
? amadan.net/carlos/platform.git/launchctx/controlname [no test files]
? amadan.net/carlos/platform.git/launchctx/wireid [no test files]
=== vet (75 s)
go: downloading github.com/aws/aws-sdk-go-v2/service/ec2 v1.324.0
go: downloading github.com/aws/aws-sdk-go-v2/service/autoscaling v1.74.0
go: downloading modernc.org/sqlite v1.55.0
go: downloading github.com/benbjohnson/litestream v0.5.14
go: downloading github.com/aws/aws-sdk-go-v2/service/sesv2 v1.66.6
go: downloading github.com/aws/aws-sdk-go-v2/service/ssm v1.74.0
go: downloading github.com/klauspost/compress v1.18.0
go: downloading golang.org/x/tools v0.47.0
go: downloading github.com/pierrec/lz4/v4 v4.1.22
go: downloading github.com/prometheus/client_golang v1.17.0
go: downloading golang.org/x/sync v0.21.0
go: downloading github.com/aws/aws-sdk-go-v2/feature/s3/manager v1.20.18
go: downloading github.com/aws/aws-sdk-go-v2/service/internal/checksum v1.9.23
go: downloading github.com/aws/aws-sdk-go-v2/service/internal/s3shared v1.19.31
go: downloading github.com/wlynxg/anet v0.0.5
go: downloading github.com/aws/aws-sdk-go-v2/aws/protocol/eventstream v1.7.14
go: downloading github.com/lmittmann/tint v1.1.3
go: downloading github.com/mattn/go-isatty v0.0.20
go: downloading github.com/aws/aws-sdk-go-v2/internal/endpoints/v2 v2.7.40
go: downloading github.com/prometheus/common v0.45.0
go: downloading github.com/cespare/xxhash/v2 v2.3.0
go: downloading github.com/prometheus/procfs v0.12.0
go: downloading google.golang.org/protobuf v1.36.10
go: downloading github.com/beorn7/perks v1.0.1
go: downloading github.com/prometheus/client_model v0.5.0
go: downloading github.com/matttproud/golang_protobuf_extensions/v2 v2.0.0
go: downloading golang.org/x/text v0.38.0
go: downloading modernc.org/libc v1.74.1
go: downloading golang.org/x/mod v0.37.0
go: downloading github.com/google/uuid v1.6.0
go: downloading modernc.org/mathutil v1.7.1
go: downloading github.com/dustin/go-humanize v1.0.1
go: downloading modernc.org/memory v1.11.0
go: downloading github.com/remyoudompheng/bigfft v0.0.0-20230129092748-24d4a6f8daec
=== gofmt (0 s)
gofmt -l .: clean
=== rest (226 s)
? github.com/carlosframework/platform/cmd/changelog [no test files]
ok github.com/carlosframework/platform/cmd/console 3.325s
ok github.com/carlosframework/platform/cmd/moveprobe 11.754s
ok github.com/carlosframework/platform/cmd/zddprobe 0.707s
ok github.com/carlosframework/platform/internal/activator 63.126s
ok github.com/carlosframework/platform/internal/agentsock 0.046s
ok github.com/carlosframework/platform/internal/alerting 0.007s
ok github.com/carlosframework/platform/internal/analytics 0.042s
ok github.com/carlosframework/platform/internal/appconfig 2.764s
ok github.com/carlosframework/platform/internal/apperr 0.121s
ok github.com/carlosframework/platform/internal/applog 0.202s
ok github.com/carlosframework/platform/internal/awsinv 0.008s
ok github.com/carlosframework/platform/internal/boxchoice 0.007s
ok github.com/carlosframework/platform/internal/boxid 0.594s
? github.com/carlosframework/platform/internal/boxid/boxidtest [no test files]
? github.com/carlosframework/platform/internal/boxid/internal/signtest [no test files]
ok github.com/carlosframework/platform/internal/boxvolumes 0.009s
ok github.com/carlosframework/platform/internal/caps 0.020s
ok github.com/carlosframework/platform/internal/certwarm 0.005s
ok github.com/carlosframework/platform/internal/cgroup 0.767s
ok github.com/carlosframework/platform/internal/changelog 0.417s
ok github.com/carlosframework/platform/internal/claimactivation 1.047s
ok github.com/carlosframework/platform/internal/clamd 0.061s
? github.com/carlosframework/platform/internal/cliflag [no test files]
? github.com/carlosframework/platform/internal/controlname [no test files]
? github.com/carlosframework/platform/internal/controlsock [no test files]
ok github.com/carlosframework/platform/internal/dbdoor 6.436s
ok github.com/carlosframework/platform/internal/dbdoor/dbdoortest 0.011s
ok github.com/carlosframework/platform/internal/dbverify 0.005s
ok github.com/carlosframework/platform/internal/dnsrec 0.005s
ok github.com/carlosframework/platform/internal/docsite 0.019s
ok github.com/carlosframework/platform/internal/domains 2.719s
ok github.com/carlosframework/platform/internal/doorkey 0.011s
ok github.com/carlosframework/platform/internal/economics 0.006s
ok github.com/carlosframework/platform/internal/edge 50.564s
? github.com/carlosframework/platform/internal/edgeproof [no test files]
ok github.com/carlosframework/platform/internal/edgesfile 0.009s
ok github.com/carlosframework/platform/internal/fleetapi 0.153s
ok github.com/carlosframework/platform/internal/gate 1.678s
ok github.com/carlosframework/platform/internal/genselect 0.020s
ok github.com/carlosframework/platform/internal/geo 0.035s
ok github.com/carlosframework/platform/internal/geoip 0.035s
ok github.com/carlosframework/platform/internal/historyreadback 0.187s
ok github.com/carlosframework/platform/internal/host 161.651s
ok github.com/carlosframework/platform/internal/hostactors 7.872s
ok github.com/carlosframework/platform/internal/hostactors/awsmembership 0.019s
ok github.com/carlosframework/platform/internal/hostbox 4.416s
ok github.com/carlosframework/platform/internal/hostclaim 1.374s
ok github.com/carlosframework/platform/internal/hostenv 0.006s
ok github.com/carlosframework/platform/internal/hostevidence 0.021s
ok github.com/carlosframework/platform/internal/hostexec 7.173s
ok github.com/carlosframework/platform/internal/hostfence 0.139s
ok github.com/carlosframework/platform/internal/hostfiles 10.904s
ok github.com/carlosframework/platform/internal/hostfloor 0.036s
ok github.com/carlosframework/platform/internal/hostguard 1.200s
ok github.com/carlosframework/platform/internal/hostops 3.035s
? github.com/carlosframework/platform/internal/hostops/fencerelease [no test files]
ok github.com/carlosframework/platform/internal/hostops/internal/fencerelease 0.006s
ok github.com/carlosframework/platform/internal/hostquarantine 0.003s
ok github.com/carlosframework/platform/internal/hostrelocate 1.107s
ok github.com/carlosframework/platform/internal/hostresolve 0.452s
ok github.com/carlosframework/platform/internal/hostwrite 0.017s
ok github.com/carlosframework/platform/internal/infraview 0.018s
ok github.com/carlosframework/platform/internal/instancectl 5.332s
ok github.com/carlosframework/platform/internal/instanceexec 3.076s
ok github.com/carlosframework/platform/internal/instancefs 0.029s
ok github.com/carlosframework/platform/internal/instancekey 0.017s
ok github.com/carlosframework/platform/internal/instanceupdates 0.016s
ok github.com/carlosframework/platform/internal/layout 2.381s
ok github.com/carlosframework/platform/internal/lbhealth 0.019s
ok github.com/carlosframework/platform/internal/lease 10.181s
ok github.com/carlosframework/platform/internal/lease/leasetest 0.921s
ok github.com/carlosframework/platform/internal/ledger 0.047s
ok github.com/carlosframework/platform/internal/mail 0.450s
ok github.com/carlosframework/platform/internal/maintenance 0.116s
ok github.com/carlosframework/platform/internal/maintenanceexec 5.766s
ok github.com/carlosframework/platform/internal/maintenanceguard 0.259s
ok github.com/carlosframework/platform/internal/metrics 0.027s
ok github.com/carlosframework/platform/internal/moves 36.780s
ok github.com/carlosframework/platform/internal/moves/archive 1.570s
ok github.com/carlosframework/platform/internal/objstore 0.461s
ok github.com/carlosframework/platform/internal/ops 0.276s
ok github.com/carlosframework/platform/internal/park 0.408s
ok github.com/carlosframework/platform/internal/plans 0.024s
ok github.com/carlosframework/platform/internal/privatefile 0.007s
ok github.com/carlosframework/platform/internal/provision 73.842s
ok github.com/carlosframework/platform/internal/publicrelease 0.009s
? github.com/carlosframework/platform/internal/regionname [no test files]
ok github.com/carlosframework/platform/internal/registry 6.569s
ok github.com/carlosframework/platform/internal/relay 7.232s
ok github.com/carlosframework/platform/internal/release 32.816s
--- FAIL: TestAMoveOntoTheInstalledGoodBuildWaitsForASignedRollback (5.03s)
--- FAIL: TestAMoveOntoTheInstalledGoodBuildWaitsForASignedRollback/socket_instance (5.02s)
holdran_test.go:796: timed out waiting for the move onto v1
FAIL
FAIL github.com/carlosframework/platform/internal/rollout 8.667s
ok github.com/carlosframework/platform/internal/rolloutwords 0.003s
ok github.com/carlosframework/platform/internal/rootaws 0.012s
ok github.com/carlosframework/platform/internal/rootparticipation 0.075s
ok github.com/carlosframework/platform/internal/rootstate 0.059s
ok github.com/carlosframework/platform/internal/runs 0.654s
ok github.com/carlosframework/platform/internal/s3compat 0.005s
ok github.com/carlosframework/platform/internal/safefile 0.007s
ok github.com/carlosframework/platform/internal/schedule 3.094s
ok github.com/carlosframework/platform/internal/seeds 0.028s
ok github.com/carlosframework/platform/internal/sim/hostlife 13.507s
ok github.com/carlosframework/platform/internal/sim/litestreamfacts 3.935s
ok github.com/carlosframework/platform/internal/status 0.132s
ok github.com/carlosframework/platform/internal/steering 0.011s
ok github.com/carlosframework/platform/internal/stopevidence 0.384s
ok github.com/carlosframework/platform/internal/svcrole 0.003s
ok github.com/carlosframework/platform/internal/telemetry 0.006s
ok github.com/carlosframework/platform/internal/termfence 0.005s
ok github.com/carlosframework/platform/internal/tunnelclient 0.006s
ok github.com/carlosframework/platform/internal/unixdial 0.005s
ok github.com/carlosframework/platform/internal/updatewords 0.006s
ok github.com/carlosframework/platform/internal/usage 0.007s
ok github.com/carlosframework/platform/internal/version 0.007s
ok github.com/carlosframework/platform/internal/vet 1.937s
FAIL
=== internal_console@0 (92 s)
ok github.com/carlosframework/platform/internal/console 90.346s
=== internal_console@1 (53 s)
ok github.com/carlosframework/platform/internal/console 51.068s
=== internal_console@2 (54 s)
ok github.com/carlosframework/platform/internal/console 51.983s
=== internal_console@3 (46 s)
ok github.com/carlosframework/platform/internal/console 44.724s
=== internal_console@4 (52 s)
ok github.com/carlosframework/platform/internal/console 50.953s
=== internal_console@5 (47 s)
ok github.com/carlosframework/platform/internal/console 45.466s
=== internal_console@6 (50 s)
ok github.com/carlosframework/platform/internal/console 48.881s
=== internal_console@7 (60 s)
ok github.com/carlosframework/platform/internal/console 58.389s
=== root@0 (49 s)
ok github.com/carlosframework/platform 47.152s
=== root@1 (56 s)
ok github.com/carlosframework/platform 54.497s
=== root@2 (53 s)
ok github.com/carlosframework/platform 51.251s
FAILED: rest
make: *** [Makefile:19: test] Error 1
amadan: step gate failed: exit status 2
amadan: job failed at step gate — its output is above, not at the tail of this log
Watching for changes…